{"text_format":"1","workbook":"xlsx","n_sheets":7,"sheets":["Accueil","Principes","Diagnostic","Résultats Globaux","Résultats par Principe","Déclaration de conformité","Hoja1"],"not_rendered":{"charts":13,"images":33,"macros":1,"external_links":0,"defined_names":9,"comments":1,"pivot_tables":0},"unopened":[],"bounds":{"document_bytes":16777216,"sheet_cells":100000,"rows_first":2000,"rows_last":500,"rows_between":2000,"halvings":0,"cell_chars":16384,"cell_head_chars":4096},"cells_cut":0,"cells_raw":0,"read":"whole","date_system":"1900"}

{"sheet":"Accueil","index":0,"n_rows":70,"n_cols":11,"rows_kept":70,"cut":false,"hidden":false,"merged":[[56,19,56,21],[0,0,0,2],[5,0,6,2],[8,0,10,2],[50,0,51,2],[53,0,57,2],[7,3,7,12],[7,0,7,2],[5,3,5,7],[5,8,5,12],[9,5,10,10],[51,3,51,10],[11,3,11,8],[1,5,2,8],[22,4,22,10],[23,4,23,10],[59,0,63,2],[59,9,59,10],[60,9,60,10],[61,9,61,10],[62,9,62,10],[63,9,63,10],[61,4,61,6],[59,4,59,6],[60,4,60,6],[63,4,63,6],[24,4,24,10],[25,4,25,10],[62,4,62,6],[54,8,54,9],[55,8,55,9],[56,8,56,9],[57,8,57,9],[53,8,53,9],[53,3,53,7],[54,3,54,7],[55,3,55,7],[56,3,56,7],[57,3,57,7],[6,3,6,10],[13,3,13,10],[8,3,8,10],[14,4,14,10],[13,0,49,2],[26,4,26,10],[27,4,27,10],[28,4,28,10],[29,4,29,10],[15,4,15,10],[16,4,16,10],[17,4,17,10],[18,4,18,10],[19,4,19,10],[20,4,20,10],[21,4,21,10]]}
[]
[null,null,null,null,null,"EXEMPLARITÉ DANS LES ORGANISATIONS"]
[]
[]
[null,null,null,null,null,"OUTIL D'AUTO-DIAGNOSTIC"]
["QU'EST-CE QUE L'EXEMPLARITÉ ? "]
[]
[]
["OBJECTIF DE \nL'AUTO- DIAGNOSTIC"]
[null,null,null,null,null,"Offrir aux organisations un moyen pour autoévaluer le déroulement de leurs activités  selon une approche globale et objective pour se projeter à un horizon de travail exemplaire.\nL'outil d'autodiagnostic permettra d'observer la situation actuelle, définir les axes sur lesquels agir, donner des pistes d'amélioration pour les traduire en plans d'actions factuels et adéquats, donner un support pour observer et comparer les résultats des changements.  "]
[]
[null,null,null,"AVEZ VOUS LU LA DESCRIPTION DE CET OUTIL? \n↓"]
[]
["MODE D'EMPLOI",null,null,"FICHIER EXCEL AUTOMATISÉ, TELECHARGEABLE GRATUIMMENT SUR LE SITE INTERNET\nwww.utc.fr/master-qualite - Travaux-\"Qualité-Management\", ref n°336"]
[null,null,null,"a","Cliquez sur le bouton \"Commencez\",  une fenêtre s'ouvrira pour saisir les informations sur l'évaluateur et sur l'organisation concernée; Pour adapter l'outil à votre organisation utilisez l'option \"Insérer logo\"."]
[null,null,null,"a","Une première section \" Principes\" s'affichera, cliquez sur chaque principe pour avoir la définition, et passez le pointeur de votre souris sur le symbole i pour afficher le \"Pourquoi ?\" de chaque grand axe."]
[null,null,null,"a","Continuez avec le diagnostic, après avoir sélectionné votre niveau d'intégration des indicateurs, une section \"Résultats Globaux obtenus\" s'affichera , ainsi que la dernière section \"Résultats par Principe\". "]
[null,null,null,"a"]
[null,null,null,"a"]
[null,null,null,"a"]
{"$rows_left_out":51}
{"sheet":"Principes","index":1,"n_rows":61,"n_cols":17,"rows_kept":61,"cut":false,"hidden":false,"merged":[[12,8,12,9],[6,7,6,10],[24,9,24,10],[25,9,25,11],[24,15,24,18],[19,16,19,18],[17,6,17,9],[21,8,21,10],[18,16,18,18],[23,14,23,16],[23,10,23,11],[19,6,19,10],[16,6,16,9],[9,16,9,20],[13,16,13,19],[0,0,0,26],[1,4,1,26],[1,0,1,3],[11,5,11,10],[11,16,11,21],[6,15,6,17],[9,5,9,10],[2,3,2,5]]}
["10 AXES POUR AGIR EN EXEMPLE "]
["POURQUOI ?   i",null,null,null,"Développement durable → Pour répondre aux attentes des parties prenantes et renforcer son image"]
[]
[]
[]
[]
[null,null,null,null,null,null,null,{"$f":"IFERROR(HYPERLINK(MiEvento($A61)),\"i\")","v":"i"},null,null,null,null,null,null,null,{"$f":"IFERROR(HYPERLINK(MiEvento($A34)),\"i\")","v":"i"}]
[]
[]
[null,null,null,null,null,null,null,null,null,null,null,null,null,null,null,null,{"$f":"IFERROR(HYPERLINK(MiEvento($A37)),\"i\")","v":"i"}]
[]
[]
[null,null,null,null,null,null,null,null,{"$f":"IFERROR(HYPERLINK(MiEvento($A58)),\"i\")","v":"i"}]
[null,null,null,null,null,null,null,null,null,null,null,null,null,null,null,null,{"$f":"IFERROR(HYPERLINK(MiEvento($A40)),\"i\")","v":"i"}]
[]
[]
[null,null,null,null,null,null,{"$f":"IFERROR(HYPERLINK(MiEvento($A55)),\"i\")","v":"i"}]
[]
[null,null,null,null,null,null,null,null,null,null,null,null,null,null,null,null,{"$f":"IFERROR(HYPERLINK(MiEvento($A43)),\"i\")","v":"i"}]
[null,null,null,null,null,null,{"$f":"IFERROR(HYPERLINK(MiEvento($A52)),\"i\")","v":"i"}]
{"$rows_left_out":42}
{"sheet":"Diagnostic","index":2,"n_rows":144,"n_cols":13,"rows_kept":144,"cut":false,"hidden":false,"merged":[[10,0,11,0],[12,3,12,7],[33,3,33,4],[36,3,36,4],[37,3,37,4],[38,3,38,4],[43,3,43,4],[45,3,45,4],[35,3,35,4],[32,3,32,4],[30,3,30,4],[10,1,11,1],[10,2,11,2],[14,3,14,4],[16,3,16,4],[18,3,18,4],[20,3,20,4],[22,3,22,4],[31,3,31,4],[24,3,24,4],[10,5,11,7],[10,3,11,4],[25,3,25,4],[29,3,29,4],[0,0,3,7],[4,2,4,7],[5,5,7,7],[5,2,5,4],[6,2,6,4],[6,0,6,1],[4,0,4,1],[5,0,5,1],[7,0,7,1],[84,3,84,4],[87,3,87,4],[88,3,88,4],[67,3,67,4],[68,3,68,4],[71,3,71,4],[72,3,72,4],[67,5,67,7],[68,5,68,7],[69,5,69,7],[71,5,71,7],[72,5,72,7],[79,5,79,7],[81,5,81,7],[83,5,83,7],[84,5,84,7],[87,5,87,7],[80,3,80,4],[91,3,91,4],[90,3,90,4],[81,3,81,4],[77,3,77,4],[76,3,76,4],[140,3,140,4],[141,3,141,4],[79,3,79,4],[83,3,83,4],[138,3,138,4],[132,3,132,4],[131,3,131,4],[130,3,130,4],[125,3,125,4],[124,3,124,4],[120,3,120,4],[116,3,116,4],[113,3,113,4],[128,3,128,4],[133,3,133,4],[135,3,135,4],[136,3,136,4],[137,3,137,4],[118,3,118,4],[142,3,142,4],[143,3,143,4],[110,3,110,4],[112,3,112,4],[115,3,115,4],[111,3,111,4],[108,3,108,4],[106,3,106,4],[93,3,93,4],[97,3,97,4],[98,3,98,4],[99,3,99,4],[102,3,102,4],[101,3,101,4],[94,3,94,4],[105,3,105,4],[109,3,109,4],[119,3,119,4],[121,3,121,4],[126,3,126,4],[127,3,127,4],[56,3,56,4],[52,3,52,4],[46,3,46,4],[42,3,42,4],[39,3,39,4],[75,3,75,4],[69,3,69,4],[66,3,66,4],[63,3,63,4],[61,3,61,4],[49,3,49,4],[50,3,50,4],[53,3,53,4],[57,3,57,4],[59,3,59,4],[60,3,60,4],[64,3,64,4],[28,3,28,4],[14,5,14,7],[16,5,16,7],[18,5,18,7],[20,5,20,7],[22,5,22,7],[24,5,24,7],[25,5,25,7],[28,5,28,7],[15,3,15,4],[21,3,21,4],[19,3,19,4],[29,5,29,7],[36,5,36,7],[37,5,37,7],[38,5,38,7],[39,5,39,7],[42,5,42,7],[30,5,30,7],[31,5,31,7],[32,5,32,7],[33,5,33,7],[35,5,35,7],[109,5,109,7],[52,5,52,7],[53,5,53,7],[56,5,56,7],[57,5,57,7],[59,5,59,7],[43,5,43,7],[45,5,45,7],[46,5,46,7],[49,5,49,7],[50,5,50,7],[119,5,119,7],[121,5,121,7],[124,5,124,7],[115,5,115,7],[116,5,116,7],[60,5,60,7],[61,5,61,7],[63,5,63,7],[64,5,64,7],[66,5,66,7],[97,5,97,7],[98,5,98,7],[99,5,99,7],[101,5,101,7],[90,5,90,7],[91,5,91,7],[93,5,93,7],[94,5,94,7],[111,5,111,7],[112,5,112,7],[113,5,113,7],[105,5,105,7],[106,5,106,7],[108,5,108,7],[120,5,120,7],[110,5,110,7],[143,5,143,7],[75,5,75,7],[76,5,76,7],[77,5,77,7],[137,5,137,7],[138,5,138,7],[140,5,140,7],[141,5,141,7],[142,5,142,7],[131,5,131,7],[132,5,132,7],[133,5,133,7],[135,5,135,7],[136,5,136,7],[125,5,125,7],[126,5,126,7],[127,5,127,7],[102,5,102,7],[88,5,88,7],[128,5,128,7],[130,5,130,7],[118,5,118,7]]}
["                 EXEMPLARITÉ DANS LES ORGANISATIONS\n                 OUTIL D'AUTO-DIAGNOSTIC"]
[]
[]
[]
["Établissement :",null,"test"]
["Date de l'autodiagnostic :",null,null,null,null,"Signature de l'évaluateur"]
["Responsable de l'évaluation :"]
["Contact de la personne responsable :",null,"Mail:","Tel:"]
[]
[]
["Réf.","Principes","Évaluation","Libellés des évaluations",null,"Commentaires"]
[null,null,null,null,null,null,null,null,"Nb Choix","taux","Pondération"]
[1,"Standardisation",null,null,null,null,null,null,null,null,null,{"$f":"IFERROR(SUM(L14:L26),\"\")","v":0},{"$f":"L13*1/10","v":0}]
[1.1000000000000001,"Référentiel",null,null,null,null,null,null,null,{"$f":"IFERROR(AVERAGE(J15:J17),\"\")","v":""},{"$f":"1/COUNTBLANK($I$14:$I$26)","v":0.33333333333333331},{"$f":"IFERROR(J14*K14,\"\")","v":""}]
["Id 1","Référentiel de travail documenté","Niveau d'intégration",{"$f":"CHOOSE(I15,\"Libellé du critère quand il sera choisi\",Accueil!$D$55,Accueil!$D$56,Accueil!$D$57,Accueil!$D$58,,)","v":"Libellé du critère quand il sera choisi"},null,null,null,null,{"$f":"IFERROR(VLOOKUP(C15,Accueil!$A$66:$B$70,2,FALSE),\"\")","v":1},{"$f":"IFERROR(CHOOSE(I15,\"\",Accueil!$K$55,Accueil!$K$56,Accueil!$K$57,Accueil!$K$58,),\"\")","v":""}]
["Id 2","Référentiel de travail actualisé","Niveau d'intégration",{"$f":"CHOOSE(I16,\"Libellé du critère quand il sera choisi\",Accueil!$D$55,Accueil!$D$56,Accueil!$D$57,Accueil!$D$58,,)","v":"Libellé du critère quand il sera choisi"},null,null,null,null,{"$f":"IFERROR(VLOOKUP(C16,Accueil!$A$66:$B$70,2,FALSE),\"\")","v":1},{"$f":"IFERROR(CHOOSE(I16,\"\",Accueil!$K$55,Accueil!$K$56,Accueil!$K$57,Accueil!$K$58,),\"\")","v":""}]
["Id 3","Référentiel de l'entreprise(Qualité, Financier) ","Niveau d'intégration",{"$f":"CHOOSE(I17,\"Libellé du critère quand il sera choisi\",Accueil!$D$55,Accueil!$D$56,Accueil!$D$57,Accueil!$D$58,,)","v":"Libellé du critère quand il sera choisi"},null,null,null,null,{"$f":"IFERROR(VLOOKUP(C17,Accueil!$A$66:$B$70,2,FALSE),\"\")","v":1},{"$f":"IFERROR(CHOOSE(I17,\"\",Accueil!$K$55,Accueil!$K$56,Accueil!$K$57,Accueil!$K$58,),\"\")","v":""}]
[1.2,"Méthode",null,null,null,null,null,null,null,{"$f":"IFERROR(AVERAGE(J19:J23),\"\")","v":""},{"$f":"1/COUNTBLANK($I$14:$I$26)","v":0.33333333333333331},{"$f":"IFERROR(J18*K18,\"\")","v":""}]
["Id 4","Activités de l'organisation documentées","Niveau d'intégration",{"$f":"CHOOSE(I19,\"Libellé du critère quand il sera choisi\",Accueil!$D$55,Accueil!$D$56,Accueil!$D$57,Accueil!$D$58,,)","v":"Libellé du critère quand il sera choisi"},null,null,null,null,{"$f":"IFERROR(VLOOKUP(C19,Accueil!$A$66:$B$70,2,FALSE),\"\")","v":1},{"$f":"IFERROR(CHOOSE(I19,\"\",Accueil!$K$55,Accueil!$K$56,Accueil!$K$57,Accueil!$K$58,),\"\")","v":""}]
["Id 5","Responsabilités des collaborateurs documentées","Niveau d'intégration",{"$f":"CHOOSE(I20,\"Libellé du critère quand il sera choisi\",Accueil!$D$55,Accueil!$D$56,Accueil!$D$57,Accueil!$D$58,,)","v":"Libellé du critère quand il sera choisi"},null,null,null,null,{"$f":"IFERROR(VLOOKUP(C20,Accueil!$A$66:$B$70,2,FALSE),\"\")","v":1},{"$f":"IFERROR(CHOOSE(I20,\"\",Accueil!$K$55,Accueil!$K$56,Accueil!$K$57,Accueil!$K$58,),\"\")","v":""}]
{"$rows_left_out":125}
{"sheet":"Résultats Globaux","index":3,"n_rows":109,"n_cols":22,"rows_kept":109,"cut":false,"hidden":false,"merged":[[105,7,105,8],[106,7,106,8],[107,7,107,8],[108,7,108,8],[4,0,4,1],[4,2,4,9],[5,0,5,1],[5,2,5,6],[5,7,7,9],[6,0,6,1],[6,2,6,6],[7,0,7,1],[7,2,7,4],[7,5,7,6],[93,2,93,4],[94,2,94,4],[0,0,3,9],[107,2,107,4],[108,2,108,4],[97,2,97,4],[98,2,98,4],[100,2,100,4],[101,2,101,4],[102,2,102,4],[103,2,103,4],[105,2,105,4],[106,2,106,4],[70,2,70,4],[71,2,71,4],[72,2,72,4],[74,2,74,4],[75,2,75,4],[95,2,95,4],[84,2,84,4],[85,2,85,4],[86,2,86,4],[87,2,87,4],[89,2,89,4],[90,2,90,4],[91,2,91,4],[99,5,99,6],[104,5,104,6],[76,5,76,6],[79,5,79,6],[82,5,82,6],[75,7,75,8],[77,7,77,8],[78,7,78,8],[80,7,80,8],[96,5,96,6],[88,5,88,6],[92,5,92,6],[84,7,84,8],[83,7,83,8],[85,7,85,8],[86,7,86,8],[77,2,77,4],[78,2,78,4],[80,2,80,4],[81,2,81,4],[83,2,83,4],[9,0,10,9],[32,0,33,9],[11,0,12,3],[11,4,12,9],[74,7,74,8],[70,7,70,8],[71,7,71,8],[72,7,72,8],[68,0,68,4],[67,7,67,8],[68,5,68,6],[65,0,66,9],[101,7,101,8],[102,7,102,8],[103,7,103,8],[69,5,69,6],[73,5,73,6],[94,7,94,8],[95,7,95,8],[97,7,97,8],[98,7,98,8],[100,7,100,8],[87,7,87,8],[89,7,89,8],[90,7,90,8],[91,7,91,8],[93,7,93,8],[81,7,81,8]]}
["                 EXEMPLARITÉ DANS LES ORGANISATIONS\n                 OUTIL D'AUTO-DIAGNOSTIC"]
[]
[]
[]
["Etablissement :",null,{"$f":"IF(Diagnostic!C5=0,\"\",Diagnostic!C5)","v":"test"}]
["Date de l'autodiagnostic :",null,{"$f":"IF(Diagnostic!C6=0,\"\",Diagnostic!C6)","v":""},null,null,null,null,"Signature de l'évaluateur"]
["Responsable de l'évaluation :",null,{"$f":"IF(Diagnostic!C7=0,\"\",Diagnostic!C7)","v":""}]
["Contact de la personne responsable :",null,{"$f":"IF(Diagnostic!C8=0,\"\",Diagnostic!C8)","v":"Mail:"},null,null,{"$f":"IF(Diagnostic!D8=0,\"\",Diagnostic!D8)","v":"Tel:"}]
[]
["TABLEAUX DE BORD SUR LES NIVEAUX D'EXEMPLARITÉ SELON LES PRINCIPES "]
[]
["NIVEAU D'EXEMPLARITÉ DES 30 FACTEURS",null,null,null,"NIVEAU D'EXEMPLARITÉ DE TOUS LES PRINCIPES"]
[]
[]
[]
[]
[null,null,null,null,null,null,null,null,null,null,null,"Initiation",{"$f":"IFERROR(COUNTIFS($H$71:$I$109,L17),0)","v":0}]
[null,null,null,null,null,null,null,null,null,null,null,"Engagement",{"$f":"IFERROR(COUNTIFS($H$71:$I$109,L18),0)","v":0}]
[null,null,null,null,null,null,null,null,null,null,null,"Performance",{"$f":"IFERROR(COUNTIFS($H$71:$I$109,L19),0)","v":0}]
[null,null,null,null,null,null,null,null,null,null,null,"Exemplarité",{"$f":"IFERROR(COUNTIFS($H$71:$I$109,L20),0)","v":0}]
{"$rows_left_out":90}
{"sheet":"Résultats par Principe","index":4,"n_rows":307,"n_cols":9,"rows_kept":307,"cut":false,"hidden":false,"merged":[[0,0,3,9],[293,4,293,9],[294,4,294,5],[294,6,294,7],[294,8,294,9],[295,4,295,5],[295,6,295,7],[295,8,295,9],[286,0,287,9],[288,0,288,1],[288,2,288,3],[288,4,288,9],[289,0,290,1],[289,2,290,3],[289,4,292,9],[270,4,274,5],[270,6,274,7],[270,8,274,9],[275,4,279,5],[275,6,279,7],[275,8,279,9],[264,4,264,5],[264,6,264,7],[264,8,264,9],[306,4,310,5],[306,6,310,7],[306,8,310,9],[296,4,300,5],[296,6,300,7],[296,8,300,9],[301,4,305,5],[301,6,305,7],[301,8,305,9],[265,4,269,5],[265,6,269,7],[265,8,269,9],[258,0,259,1],[258,2,259,3],[258,4,261,9],[262,4,262,9],[263,4,263,5],[263,6,263,7],[263,8,263,9],[243,4,247,5],[243,6,247,7],[243,8,247,9],[255,0,256,9],[257,0,257,1],[257,2,257,3],[257,4,257,9],[233,4,237,5],[233,6,237,7],[233,8,237,9],[238,4,242,5],[238,6,242,7],[238,8,242,9],[230,4,230,9],[231,4,231,5],[231,6,231,7],[231,8,231,9],[232,4,232,5],[232,6,232,7],[232,8,232,9],[223,0,224,9],[225,0,225,1],[225,2,225,3],[225,4,225,9],[226,0,227,1],[226,2,227,3],[226,4,229,9],[208,4,212,5],[208,6,212,7],[208,8,212,9],[213,4,217,5],[213,6,217,7],[213,8,217,9],[202,4,202,5],[202,6,202,7],[202,8,202,9],[203,4,207,5],[203,6,207,7],[203,8,207,9],[196,0,197,1],[196,2,197,3],[196,4,199,9],[200,4,200,9],[201,4,201,5],[201,6,201,7],[201,8,201,9],[182,4,186,5],[182,6,186,7],[182,8,186,9],[193,0,194,9],[195,0,195,1],[195,2,195,3],[195,4,195,9],[172,4,176,5],[172,6,176,7],[172,8,176,9],[177,4,181,5],[177,6,181,7],[177,8,181,9],[169,4,169,9],[170,4,170,5],[170,6,170,7],[170,8,170,9],[171,4,171,5],[171,6,171,7],[171,8,171,9],[162,0,163,9],[164,0,164,1],[164,2,164,3],[164,4,164,9],[165,0,166,1],[165,2,166,3],[165,4,168,9],[146,4,150,5],[146,6,150,7],[146,8,150,9],[151,4,155,5],[151,6,155,7],[151,8,155,9],[140,4,140,5],[140,6,140,7],[140,8,140,9],[141,4,145,5],[141,6,145,7],[141,8,145,9],[134,0,135,1],[134,2,135,3],[134,4,137,9],[138,4,138,9],[139,4,139,5],[139,6,139,7],[139,8,139,9],[120,4,124,5],[120,6,124,7],[120,8,124,9],[131,0,132,9],[133,0,133,1],[133,2,133,3],[133,4,133,9],[110,4,114,5],[110,6,114,7],[110,8,114,9],[115,8,119,9],[115,6,119,7],[115,4,119,5],[107,4,107,9],[108,4,108,5],[108,6,108,7],[108,8,108,9],[109,4,109,5],[109,6,109,7],[109,8,109,9],[100,0,101,9],[102,0,102,1],[102,2,102,3],[103,0,104,1],[103,2,104,3],[103,4,106,9],[102,4,102,9],[83,4,87,5],[83,6,87,7],[83,8,87,9],[88,4,92,5],[88,6,92,7],[88,8,92,9],[77,4,77,5],[77,6,77,7],[77,8,77,9],[78,4,82,5],[78,6,82,7],[78,8,82,9],[71,0,72,1],[71,2,72,3],[71,4,74,9],[75,4,75,9],[76,4,76,5],[76,6,76,7],[76,8,76,9],[55,4,59,5],[55,6,59,7],[55,8,59,9],[68,0,69,9],[70,0,70,1],[70,2,70,3],[70,4,70,9],[45,4,49,5],[45,6,49,7],[45,8,49,9],[50,4,54,5],[50,6,54,7],[50,8,54,9],[42,4,42,9],[43,4,43,5],[43,6,43,7],[43,8,43,9],[44,4,44,5],[44,6,44,7],[44,8,44,9],[35,0,36,9],[37,0,37,1],[37,2,37,3],[37,4,37,9],[38,0,39,1],[38,2,39,3],[38,4,41,9],[23,4,27,5],[23,6,27,7],[23,8,27,9],[28,4,32,5],[28,6,32,7],[28,8,32,9],[17,8,17,9],[16,8,16,9],[15,4,15,9],[18,4,22,5],[18,6,22,7],[18,8,22,9],[16,4,16,5],[17,4,17,5],[16,6,16,7],[17,6,17,7],[10,0,10,1],[10,2,10,3],[8,0,9,9],[10,4,10,9],[11,4,14,9],[11,0,12,1],[11,2,12,3],[4,0,4,1],[4,2,4,9],[7,2,7,4],[7,5,7,6],[5,0,5,1],[5,2,5,6],[5,7,7,9],[6,0,6,1],[6,2,6,6],[7,0,7,1]]}
["                 EXEMPLARITÉ DANS LES ORGANISATIONS\n                 OUTIL D'AUTO-DIAGNOSTIC"]
[]
[]
[]
["Etablissement :",null,{"$f":"IF(Diagnostic!C5=0,\"\",Diagnostic!C5)","v":"test"}]
["Date de l'autodiagnostic :",null,{"$f":"IF(Diagnostic!C6=0,\"\",Diagnostic!C6)","v":""},null,null,null,null,"Signature de l'évaluateur"]
["Responsable de l'évaluation :",null,{"$f":"IF(Diagnostic!C7=0,\"\",Diagnostic!C7)","v":""}]
["Contact de la personne responsable :",null,{"$f":"IF(Diagnostic!C8=0,\"\",Diagnostic!C8)","v":"Mail:"},null,null,{"$f":"IF(Diagnostic!D8=0,\"\",Diagnostic!D8)","v":"Tel:"}]
["PRINCIPE 1.  STANDARISATION"]
[]
["Niveau d'exemplarité",null,"Taux d'exemplarité",null," Commentaires sur les résultats obtenus :"]
[{"$f":"'Résultats Globaux'!F70","v":"Initiation"},null,{"$f":"'Résultats Globaux'!J70","v":0}]
[]
[]
[]
[null,null,null,null,"Décisions: Plan d'actions prioritaires"]
[null,null,null,null,"QUOI ",null,"QUI",null,"QUAND ET OU"]
[null,null,null,null,"Objectifs à atteindre",null,"En interne ou en externe",null,"Date et champ d'application"]
[null,null,null,null,"Plan n°1:"]
[]
{"$rows_left_out":288}
{"sheet":"Déclaration de conformité","index":5,"n_rows":40,"n_cols":6,"rows_kept":40,"cut":false,"hidden":false,"merged":[[23,0,23,5],[29,0,29,5],[31,0,31,2],[31,3,31,5],[33,0,33,2],[33,3,33,5],[24,0,24,5],[25,0,25,2],[25,3,25,5],[26,3,27,5],[26,0,27,2],[38,0,38,2],[34,0,34,2],[34,3,34,5],[35,0,35,2],[35,3,35,5],[36,0,36,2],[36,3,36,4],[7,0,7,5],[8,0,8,5],[10,0,10,3],[11,0,11,3],[0,0,0,5],[1,0,1,5],[2,0,2,2],[2,3,2,5],[3,0,3,2],[3,3,3,5],[6,0,6,5],[4,0,5,5],[12,0,12,3],[13,0,13,3],[14,0,14,3],[15,0,15,3],[16,0,16,3],[17,0,17,3],[18,0,18,3],[19,0,19,3],[20,0,20,3],[21,0,21,3]]}
["Déclaration de conformité selon l'ISO 17050 Partie 1 : Exigences générales"]
["Évaluation de la conformité - Déclaration de conformité du fournisseur (NF EN ISO/CEI 17050-1)"]
["Date limite de validité de la déclaration :",null,null,"Référence unique de la déclaration ISO 17050 :"]
[{"$f":"IFERROR(A39+364,\"Date de la déclaration + 1 an\")","v":"Date de la déclaration + 1 an"},null,null,{"$f":"IF(A39=\"\",\"remplir la cellule de date de la déclaration (onglet ISO 17050)\",IF(ISERROR(YEAR(A39)),\"date de la déclaration invalide\",CONCATENATE(\"Autodeclaration_ISO_17050_sur_la_NF_S99-170_en_\",YEAR(A39),\"_\",MONTH(A39),\"_\",DAY(A39))))","v":"date de la déclaration invalide"}]
["Objet de la déclaration : Niveau de CONFORMITÉ aux PRINCIPES de l'EXEMPLARITÉ"]
[]
[{"$f":"IF(Diagnostic!C5=\"\",\"Nom de l'établissement\",Diagnostic!C5)","v":"test"}]
["Nous, soussignés, déclarons sous notre propre responsabilité que les niveaux de conformité de nos pratiques professionnelles ont été mesurés d'après les principes de l'Exemplarité"]
["Nous avons appliqué la meilleure rigueur d'élaboration et d'analyse (évaluation par plusieurs personnes compétentes) et nous avons respecté les règles d'éthique professionnelle (absence de conflits d'intérêt, respect des opinions, liberté des choix) pour parvenir aux résultats ci-dessous."]
[]
["Tableau des résultats de CONFORMITÉ de nos activités \nselon les principes de l'EXEMPLARITÉ",null,null,null,"Taux moyen","Niveaux d'exemplarité"]
[{"$f":"'Résultats Globaux'!A69:E69","v":"Niveau moyen sur l'ensemble des principes de l'Exemplarité"},null,null,null,{"$f":"'Résultats Globaux'!J69","v":0},{"$f":"IF('Résultats Globaux'!F69:G69=Accueil!J64,'Résultats Globaux'!F69:G69,\"Non déclarable\")","v":"Non déclarable"}]
[{"$f":"CONCATENATE('Résultats Globaux'!A70,\" : \",'Résultats Globaux'!B70)","v":"Pr. 1 : Standarisation"},null,null,null,{"$f":"'Résultats Globaux'!J70","v":0},{"$f":"IF('Résultats Globaux'!F70:G70=Accueil!J64,'Résultats Globaux'!F70:G70,\"Non déclarable\")","v":"Non déclarable"}]
[{"$f":"CONCATENATE('Résultats Globaux'!A74,\" : \",'Résultats Globaux'!B74)","v":"Pr. 2 : Valeur, éthique et humanisme"},null,null,null,{"$f":"'Résultats Globaux'!J74","v":0},{"$f":"IF('Résultats Globaux'!F74:G74=Accueil!J64,'Résultats Globaux'!F74:G74,\"Non déclarable\")","v":"Non déclarable"}]
[{"$f":"CONCATENATE('Résultats Globaux'!A77,\" : \",'Résultats Globaux'!B74)","v":"Pr. 3 : Valeur, éthique et humanisme"},null,null,null,{"$f":"'Résultats Globaux'!J77","v":0},{"$f":"IF('Résultats Globaux'!F77:G77=Accueil!J64,'Résultats Globaux'!F77:G77,\"Non déclarable\")","v":"Non déclarable"}]
[{"$f":"CONCATENATE('Résultats Globaux'!A80, \" : \", 'Résultats Globaux'!B80)","v":"Pr. 4 : Redevabilité"},null,null,null,{"$f":"'Résultats Globaux'!J80","v":0},{"$f":"IF('Résultats Globaux'!F80:G80=Accueil!$J$64,'Résultats Globaux'!F80:G80,\"Non déclarable\")","v":"Non déclarable"}]
[{"$f":"CONCATENATE('Résultats Globaux'!A83, \" : \", 'Résultats Globaux'!B83)","v":"Pr. 5 : Leadership"},null,null,null,{"$f":"'Résultats Globaux'!J83","v":0},{"$f":"IF('Résultats Globaux'!F83:G83=Accueil!$J$64,'Résultats Globaux'!F83:G83,\"Non déclarable\")","v":"Non déclarable"}]
[{"$f":"CONCATENATE('Résultats Globaux'!A89, \" : \", 'Résultats Globaux'!B89)","v":"Pr. 6 : Crédibilité"},null,null,null,{"$f":"'Résultats Globaux'!J89","v":0},{"$f":"IF('Résultats Globaux'!F89:G89=Accueil!$J$64,'Résultats Globaux'!F89:G89,\"Non déclarable\")","v":"Non déclarable"}]
[{"$f":"CONCATENATE('Résultats Globaux'!A93, \" : \", 'Résultats Globaux'!B93)","v":"Pr. 7 : Vigilance et précaution"},null,null,null,{"$f":"'Résultats Globaux'!J93","v":0},{"$f":"IF('Résultats Globaux'!F93:G93=Accueil!$J$64,'Résultats Globaux'!F93:G93,\"Non déclarable\")","v":"Non déclarable"}]
[{"$f":"CONCATENATE('Résultats Globaux'!A97, \" : \", 'Résultats Globaux'!B97)","v":"Pr. 8  : Transmission de savoir "},null,null,null,{"$f":"'Résultats Globaux'!J97","v":0},{"$f":"IF('Résultats Globaux'!F97:G97=Accueil!$J$64,'Résultats Globaux'!F97:G97,\"Non déclarable\")","v":"Non déclarable"}]
{"$rows_left_out":21}
{"sheet":"Hoja1","index":6,"n_rows":48,"n_cols":8,"rows_kept":48,"cut":false,"hidden":true,"merged":[[36,7,37,9],[39,5,42,6],[39,7,42,9],[44,5,47,6],[44,7,47,9],[38,5,38,6],[22,7,26,9],[28,5,30,6],[28,7,30,9],[32,5,34,6],[32,7,34,9],[27,5,27,6],[11,2,11,4],[7,5,7,6],[7,7,7,9],[9,5,11,6],[9,7,11,9],[7,0,7,4],[8,5,8,6],[9,2,9,4],[10,2,10,4],[19,2,19,4],[18,1,18,4],[12,5,12,6],[13,2,13,4],[14,2,14,4],[15,5,15,6],[15,1,15,4],[13,5,14,6],[16,2,16,4],[17,2,17,4],[13,7,14,9],[16,5,17,6],[16,7,17,9],[19,5,20,6],[19,7,20,9],[18,5,18,6],[24,2,24,4],[25,2,25,4],[26,2,26,4],[20,2,20,4],[21,5,21,6],[22,2,22,4],[23,2,23,4],[21,1,21,4],[22,5,26,6],[28,2,28,4],[29,2,29,4],[30,2,30,4],[27,1,27,4],[37,2,37,4],[35,1,35,4],[38,1,38,4],[31,5,31,6],[32,2,32,4],[33,2,33,4],[34,2,34,4],[31,1,31,4],[36,5,37,6],[46,2,46,4],[47,2,47,4],[0,0,3,9],[5,0,6,9],[8,1,8,4],[12,1,12,4],[42,2,42,4],[43,5,43,6],[44,2,44,4],[45,2,45,4],[43,1,43,4],[39,2,39,4],[40,2,40,4],[41,2,41,4],[35,5,35,6],[36,2,36,4]]}
["                 EXEMPLARITÉ DANS LES ORGANISATIONS\n                 OUTIL D'AUTO-DIAGNOSTIC"]
[]
[]
[]
[]
["Quelques CONSEILS pour atteindre l'exemplarité"]
[]
["Caractéristiques",null,null,null,null,"QUI",null,"QUOI"]
["Car. 1","Standarisation"]
[null,1.1000000000000001,"Méthode"]
[null,1.2,"Référentiel"]
[null,1.3,"Pérennité"]
["Car. 2","Valeur, éthique et humanisme"]
[null,2.1,"Valoriser l'humain"]
[null,2.2000000000000002,"Respecter l'humain"]
["Car. 3","Transparence"]
[null,3.1,"Communication"]
[null,3.2,"Fiabilité de l'information"]
["Car. 4","Redevabilité"]
[null,4.0999999999999996,"Impact"]
{"$rows_left_out":28}