{"text_format":"3","workbook":"xlsx","n_sheets":3,"sheets":["GE","Philips","Siemens"],"not_rendered":{"macros":1},"read":"whole","date_system":"1900"}

{"sheet":"GE","index":0,"n_rows":58,"n_cols":22,"rows_kept":58,"merged":[[1,0,1,20],[36,3,42,3],[36,4,42,4],[45,3,51,3],[45,4,51,4],[54,3,56,3],[54,4,56,4]]}
[]
[" CONTRÔLES D'EQUIPEMENTS GENERAL ELECTRIC EFFECTUES"]
[]
["CI","Contrôle interne"]
["CE","Contrôle externe"]
["CR","Contrôle radioprotection"]
["MP","Maintenance préventive",{"$nulls":16},"²"]
[]
["Secteur","Description des matériels"," INVENTAIRE","SALLE","N°SYSTEME","Janv.","Fevr.","Mars","Avril ","Mai","Juin","Juillet","Août","Sept.","Oct.","Nov.","Déc.","CI","CE","CR","MP","A FAIRE"]
["RADIO","MOBILE DE RADIOGRAPHIE","9405764","Bloc 4/5","B41680006",{"$nulls":12},{"$f":"IF(COUNTIF($F10:$Q10,\"CI\")>=1,\"OK\",\"\")","v":""},{"$f":"IF(COUNTIF($F10:$Q10,\"CE\")>=1,\"OK\",\"\")","v":""},{"$f":"IF(COUNTIF($F10:$Q10,\"CR\")>=1,\"OK\",\"\")","v":""},{"$f":"IF(COUNTIF($F10:$Q10,\"MP\")>=1,\"OK\",\"\")","v":""}]
["RADIO","MOBILE DE RADIOGRAPHIE","200405332","Etages","M4168057",{"$nulls":12},{"$f":"IF(COUNTIF($F11:$Q11,\"CI\")>=1,\"OK\",\"\")","v":""},{"$f":"IF(COUNTIF($F11:$Q11,\"CE\")>=1,\"OK\",\"\")","v":""},{"$f":"IF(COUNTIF($F11:$Q11,\"CR\")>=1,\"OK\",\"\")","v":""},{"$f":"IF(COUNTIF($F11:$Q11,\"MP\")>=1,\"OK\",\"\")","v":""}]
["RADIO","MOBILE DE RADIOGRAPHIE","200405333","Etages","M4168058",null,null,"CI",{"$nulls":6},"CE",null,null,"OK","OK","",""]
["RADIO","MOBILE DE RADIOGRAPHIE","200405334","Etages","M4168059",{"$nulls":6},"CI",{"$nulls":5},"OK","","",""]
["BLOC45","MOBILE DE RADIOGRAPHIE","200405335","Bloc 4/5","B4168012",{"$nulls":12},"","","",""]
["RADIO","MOBILE DE RADIOGRAPHIE","200405336","Bloc Urg","M4168060",{"$nulls":6},"CI",{"$nulls":5},"OK","","",""]
["BLOC2","MOBILE DE RADIOGRAPHIE","200405337","Bloc 2","B4168011",{"$nulls":7},"MP",null,null,"CR",null,"","","OK","OK"]
["RADIO","MOBILE DE RADIOGRAPHIE","9705529","Bloc Urg","M4168047",{"$nulls":12},"","","",""]
["BLOC3","MOBILE DE RADIOGRAPHIE","9705530","FEH","M4168009",{"$nulls":8},"CE",{"$nulls":3},"","OK","",""]
["RADIO Clém.","MOBILE DE RADIOGRAPHIE","9102385","Clem","D4168007",{"$nulls":10},"CR",null,"","","OK",""]
["NEURO RAD.","MOBILE DE RADIOGRAPHIE","9405554","Neuroradio","A4168007",{"$nulls":12},"","","",""]
["Bloc FEH","MOBILE DE RADIOGRAPHIE",200905453,"Bloc FEH","M4168075",{"$nulls":12},"","","",""]
["RADIO","MOBILE DE RADIOGRAPHIE",201005090,"Etages","M4168079",{"$nulls":12},"","","",""]
[{"$nulls":17},{"$f":"COUNTIF(R10:R22,\"OK\")/COUNTA(R10:R22)","v":{"v":0.23076923076923078,"d":"23.1%"}},{"$f":"COUNTIF(S10:S22,\"OK\")/COUNTA(S10:S22)","v":{"v":0.15384615384615385,"d":"15.4%"}},{"$f":"COUNTIF(T10:T22,\"OK\")/COUNTA(T10:T22)","v":{"v":0.15384615384615385,"d":"15.4%"}},{"$f":"COUNTIF(U10:U22,\"OK\")/COUNTA(U10:U22)","v":{"v":0.07692307692307693,"d":"7.7%"}},{"$f":"COUNTIF(R10:U22,\"<>OK\")/COUNTA(R10:U22)","v":{"v":0.8461538461538461,"d":"84.6%"}}]
["Secteur","Description des matériels"," INVENTAIRE","SALLE","N°SYSTEME","Janv.","Fevr.","Mars","Avril ","Mai","Juin","Juillet","Août","Sept.","Oct.","Nov.","Déc.","CI","CE","CR","MP","A FAIRE"]
["BLOC URG.","MOBILE DE RADIOSCOPIE","200305030","Bloc Urg","B4168010",{"$nulls":12},{"$f":"IF(COUNTIF($F25:$Q25,\"CI\")>=1,\"OK\",\"\")","v":""},{"$f":"IF(COUNTIF($F25:$Q25,\"CE\")>=1,\"OK\",\"\")","v":""},{"$f":"IF(COUNTIF($F25:$Q25,\"CR\")>=1,\"OK\",\"\")","v":""},{"$f":"IF(COUNTIF($F25:$Q25,\"MP\")>=1,\"OK\",\"\")","v":""}]
["BLOC 6","MOBILE DE RADIOSCOPIE","200405114","Bloc 6","I4168001",{"$nulls":12},"","","",""]
["BLOC 2","MOBILE DE RADIOSCOPIE","200705002","Bloc 2","B4168013",{"$nulls":12},"","","",""]
["BLOC 1","MOBILE DE RADIOSCOPIE","9505864","Bloc 1","B4168007",{"$nulls":12},"","","",""]
["BLOC 4/5","MOBILE DE RADIOSCOPIE","9705198","Bloc 4/5","B4168008",{"$nulls":12},"","","",""]
["NEURA RAD.","MOBILE DE RADIOSCOPIE","9805526","Neuroradio","M4168056",{"$nulls":12},"","","",""]
["NIV. 20","MOBILE DE RADIOSCOPIE",200905170,"PTC","C4168002",{"$nulls":12},"","","",""]
["BLOC FEH","MOBILE DE RADIOSCOPIE",200805540,"Bloc FEH","K4168001",{"$nulls":12},"","","",""]
["NIV. 20","MOBILE DE RADIOSCOPIE",201005118,"PTC","C4168003",{"$nulls":12},"","","",""]
["RADIO","SALLE DE RADIOLOGIE POLYVALENTE","200605622","Salle 10","M4168064",{"$nulls":12},"","","",""]
[{"$nulls":17},{"$f":"COUNTIF(R25:R34,\"OK\")/COUNTA(R25:R34)","v":{"v":0,"d":"0.0%"}},{"$f":"COUNTIF(S25:S34,\"OK\")/COUNTA(S25:S34)","v":{"v":0,"d":"0.0%"}},{"$f":"COUNTIF(T25:T34,\"OK\")/COUNTA(T25:T34)","v":{"v":0,"d":"0.0%"}},{"$f":"COUNTIF(U25:U34,\"OK\")/COUNTA(U25:U34)","v":{"v":0,"d":"0.0%"}},{"$f":"COUNTIF(R25:U34,\"<>OK\")/COUNTA(R25:U34)","v":{"v":1,"d":"100.0%"}}]
["Secteur","Description des matériels"," INVENTAIRE","SALLE","N°SYSTEME","Janv.","Fevr.","Mars","Avril ","Mai","Juin","Juillet","Août","Sept.","Oct.","Nov.","Déc.","CI","CE","CR","MP","A FAIRE"]
["RADIO","SUSPENSION PORTE-TUBE","9000077","Salle 2","M4168002",{"$nulls":12},{"$f":"IF(COUNTIF($F37:$Q37,\"CI\")>=1,\"OK\",\"\")","v":""},{"$f":"IF(COUNTIF($F37:$Q37,\"CE\")>=1,\"OK\",\"\")","v":""},{"$f":"IF(COUNTIF($F37:$Q37,\"CR\")>=1,\"OK\",\"\")","v":""},{"$f":"IF(COUNTIF($F37:$Q37,\"MP\")>=1,\"OK\",\"\")","v":""}]
["RADIO","TUBE RX","9000077A",{"$nulls":8},"MP",null,"CI",null,"CR",null,"OK","","OK","OK"]
["RADIO","GAINE RX","9000077B",{"$nulls":9},"CE",null,null,"CR",null,"","OK","OK",""]
["RADIO","SYSTEME DE RADIOGRAPHIE NUMERIQUE","200005060",{"$nulls":13},"CR","","","OK",""]
["RADIO","GENERATEUR DE RADIOLOGIE","200005066",{"$nulls":9},"MP","CR",{"$nulls":3},"","","OK","OK"]
["RADIO","TABLE TELECOMMANDEE","9000074",{"$nulls":10},"MP",{"$nulls":3},"","","","OK"]
["RADIO","TUBE RX","200005065",{"$nulls":14},"","","",""]
[{"$nulls":17},{"$f":"COUNTIF(R37:R43,\"OK\")/COUNTA(R37:R43)","v":{"v":0.14285714285714285,"d":"14.3%"}},{"$f":"COUNTIF(S37:S43,\"OK\")/COUNTA(S37:S43)","v":{"v":0.14285714285714285,"d":"14.3%"}},{"$f":"COUNTIF(T37:T43,\"OK\")/COUNTA(T37:T43)","v":{"v":0.5714285714285714,"d":"57.1%"}},{"$f":"COUNTIF(U37:U43,\"OK\")/COUNTA(U37:U43)","v":{"v":0.42857142857142855,"d":"42.9%"}},{"$f":"COUNTIF(R37:U43,\"<>U42:V43OK\")/COUNTA(R37:U43)","v":{"v":1,"d":"100.0%"}}]
["Secteur","Description des matériels"," INVENTAIRE","SALLE","N°SYSTEME","Janv.","Fevr.","Mars","Avril ","Mai","Juin","Juillet","Août","Sept.","Oct.","Nov.","Déc.","CI","CE","CR","MP","A FAIRE"]
["RADIO","GENERATEUR DE RADIOLOGIE","9805237","Salle 3","M4168003",{"$nulls":12},{"$f":"IF(COUNTIF($F46:$Q46,\"CI\")>=1,\"OK\",\"\")","v":""},{"$f":"IF(COUNTIF($F46:$Q46,\"CE\")>=1,\"OK\",\"\")","v":""},{"$f":"IF(COUNTIF($F46:$Q46,\"CR\")>=1,\"OK\",\"\")","v":""},{"$f":"IF(COUNTIF($F46:$Q46,\"MP\")>=1,\"OK\",\"\")","v":""}]
["RADIO","COLONNE PORTE-TUBE","8500362",{"$nulls":14},"",{"$f":"IF(COUNTIF($F47:$Q47,\"CE\")>=1,\"OK\",\"\")","v":""},"",""]
["RADIO","SUSPENSION PORTE-TUBE","9000075",{"$nulls":14},"","","",""]
["RADIO","TUBE RX","8500362A",{"$nulls":14},"","","",""]
["RADIO","GAINE RX","8500362B",{"$nulls":14},"","","",""]
["RADIO","TUBE RX","9000075A",{"$nulls":14},"","","",""]
["RADIO","GAINE RX","9000075B",{"$nulls":14},"","","",""]
[{"$nulls":17},{"$f":"COUNTIF(R46:R52,\"OK\")/COUNTA(R46:R52)","v":{"v":0,"d":"0.0%"}},{"$f":"COUNTIF(S46:S52,\"OK\")/COUNTA(S46:S52)","v":{"v":0,"d":"0.0%"}},{"$f":"COUNTIF(T46:T52,\"OK\")/COUNTA(T46:T52)","v":{"v":0,"d":"0.0%"}},{"$f":"COUNTIF(U46:U52,\"OK\")/COUNTA(U46:U52)","v":{"v":0,"d":"0.0%"}},{"$f":"COUNTIF(R46:U52,\"<>OK\")/COUNTA(R46:U52)","v":{"v":1,"d":"100.0%"}}]
["Secteur","Description des matériels"," INVENTAIRE","SALLE","N°SYSTEME","Janv.","Fevr.","Mars","Avril ","Mai","Juin","Juillet","Août","Sept.","Oct.","Nov.","Déc.","CI","CE","CR","MP","A FAIRE"]
["RADIO Clém.","TABLE TELECOMMANDE  HAUTEUR VAR.","9705545","Salle 4C","D4168009",{"$nulls":12},{"$f":"IF(COUNTIF($F55:$Q55,\"CI\")>=1,\"OK\",\"\")","v":""},{"$f":"IF(COUNTIF($F55:$Q55,\"CE\")>=1,\"OK\",\"\")","v":""},{"$f":"IF(COUNTIF($F55:$Q55,\"CR\")>=1,\"OK\",\"\")","v":""},{"$f":"IF(COUNTIF($F55:$Q55,\"MP\")>=1,\"OK\",\"\")","v":""}]
["RADIO Clém.","GENERATEUR DE RADIOLOGIE","9705546",{"$nulls":14},{"$f":"IF(COUNTIF($F56:$Q56,\"CI\")>=1,\"OK\",\"\")","v":""},{"$f":"IF(COUNTIF($F56:$Q56,\"CE\")>=1,\"OK\",\"\")","v":""},{"$f":"IF(COUNTIF($F56:$Q56,\"CR\")>=1,\"OK\",\"\")","v":""},{"$f":"IF(COUNTIF($F56:$Q56,\"MP\")>=1,\"OK\",\"\")","v":""}]
["RADIO Clém.","TUBE RX","9705547",{"$nulls":14},{"$f":"IF(COUNTIF($F57:$Q57,\"CI\")>=1,\"OK\",\"\")","v":""},{"$f":"IF(COUNTIF($F57:$Q57,\"CE\")>=1,\"OK\",\"\")","v":""},{"$f":"IF(COUNTIF($F57:$Q57,\"CR\")>=1,\"OK\",\"\")","v":""},{"$f":"IF(COUNTIF($F57:$Q57,\"MP\")>=1,\"OK\",\"\")","v":""}]
[{"$nulls":17},{"$f":"COUNTIF(R55:R57,\"OK\")/COUNTA(R55:R57)","v":{"v":0,"d":"0.0%"}},{"$f":"COUNTIF(S51:S57,\"OK\")/COUNTA(S51:S57)","v":{"v":0,"d":"0.0%"}},{"$f":"COUNTIF(T51:T57,\"OK\")/COUNTA(T51:T57)","v":{"v":0,"d":"0.0%"}},{"$f":"COUNTIF(U51:U57,\"OK\")/COUNTA(U51:U57)","v":{"v":0,"d":"0.0%"}},{"$f":"COUNTIF(R55:U57,\"<>OK\")/COUNTA(R55:U57)","v":{"v":1,"d":"100.0%"}}]

{"sheet":"Philips","index":1,"n_rows":35,"n_cols":22,"rows_kept":35,"merged":[[1,0,1,20],[12,3,16,3],[12,4,16,4],[18,3,20,3],[18,4,20,4],[23,3,26,3],[23,4,26,4],[28,3,30,3],[28,4,30,4],[32,3,33,3],[32,4,33,4]]}
[]
[" CONTRÔLES D'EQUIPEMENTS PHILIPS EFFECTUES"]
[]
["CI","Contrôle interne"]
["CE","Contrôle externe"]
["CR","Contrôle radioprotection"]
["MP","Maintenance préventive"]
[]
["Secteur","Description des matériels"," INVENTAIRE","SALLE","N°SYSTEME","Janv.","Fevr.","Mars","Avril ","Mai","Juin","Juillet","Août","Sept.","Oct.","Nov.","Déc.","CI","CE","CR","MP"]
["RADIO Clém","MOBILE DE RADIOGRAPHIE","9405528","Dermato",75392,{"$nulls":4},"CE",{"$nulls":4},"MP",null,null,{"$f":"IF(COUNTIF($F10:$Q10,\"CI\")>=1,\"OK\",\"\")","v":""},{"$f":"IF(COUNTIF($F10:$Q10,\"CE\")>=1,\"OK\",\"\")","v":"OK"},{"$f":"IF(COUNTIF($F10:$Q10,\"CR\")>=1,\"OK\",\"\")","v":""},{"$f":"IF(COUNTIF($F10:$Q10,\"MP\")>=1,\"OK\",\"\")","v":"OK"}]
["BLOC URG","MOBILE DE RADIOSCOPIE","200705370","Bloc Urg",30234431,{"$nulls":6},"CI",{"$nulls":4},"CR",{"$f":"IF(COUNTIF($F11:$Q11,\"CI\")>=1,\"OK\",\"\")","v":"OK"},{"$f":"IF(COUNTIF($F11:$Q11,\"CE\")>=1,\"OK\",\"\")","v":""},{"$f":"IF(COUNTIF($F11:$Q11,\"CR\")>=1,\"OK\",\"\")","v":"OK"},{"$f":"IF(COUNTIF($F11:$Q11,\"MP\")>=1,\"OK\",\"\")","v":""}]
[{"$nulls":17},{"$f":"COUNTIF(R10:R11,\"OK\")/COUNTA(R10:R11)","v":{"v":0.5,"d":"50.0%"}},{"$f":"COUNTIF(S10:S11,\"OK\")/COUNTA(S10:S11)","v":{"v":0.5,"d":"50.0%"}},{"$f":"COUNTIF(T10:T11,\"OK\")/COUNTA(T10:T11)","v":{"v":0.5,"d":"50.0%"}},{"$f":"COUNTIF(U10:U11,\"OK\")/COUNTA(U10:U11)","v":{"v":0.5,"d":"50.0%"}},{"$f":"COUNTIF(R10:U11,\"<>OK\")/COUNTA(R10:U11)","v":{"v":0.5,"d":"50.0%"}}]
["NEURO RAD.","STATIF ARCEAU PLAFONNIER","200405174","Allura",92249,{"$nulls":10},"MP",null,{"$f":"IF(COUNTIF($F13:$Q13,\"CI\")>=1,\"OK\",\"\")","v":""},{"$f":"IF(COUNTIF($F13:$Q13,\"CE\")>=1,\"OK\",\"\")","v":""},{"$f":"IF(COUNTIF($F13:$Q13,\"CR\")>=1,\"OK\",\"\")","v":""},{"$f":"IF(COUNTIF($F13:$Q13,\"MP\")>=1,\"OK\",\"\")","v":"OK"}]
["NEURO RAD.","TABLE PLATEAU HV","200405175",{"$nulls":9},"CI",null,"CR",null,null,{"$f":"IF(COUNTIF($F14:$Q14,\"CI\")>=1,\"OK\",\"\")","v":"OK"},{"$f":"IF(COUNTIF($F14:$Q14,\"CE\")>=1,\"OK\",\"\")","v":""},{"$f":"IF(COUNTIF($F14:$Q14,\"CR\")>=1,\"OK\",\"\")","v":"OK"},{"$f":"IF(COUNTIF($F14:$Q14,\"MP\")>=1,\"OK\",\"\")","v":""}]
["NEURO RAD.","GENERATEUR DE RADIOLOGIE","200405183",{"$nulls":7},"CE",{"$nulls":6},{"$f":"IF(COUNTIF($F15:$Q15,\"CI\")>=1,\"OK\",\"\")","v":""},{"$f":"IF(COUNTIF($F15:$Q15,\"CE\")>=1,\"OK\",\"\")","v":"OK"},{"$f":"IF(COUNTIF($F15:$Q15,\"CR\")>=1,\"OK\",\"\")","v":""},{"$f":"IF(COUNTIF($F15:$Q15,\"MP\")>=1,\"OK\",\"\")","v":""}]
["NEURO RAD.","STATION DE GRAVAGE","200405191",{"$nulls":11},"MP","CR",null,{"$f":"IF(COUNTIF($F16:$Q16,\"CI\")>=1,\"OK\",\"\")","v":""},{"$f":"IF(COUNTIF($F16:$Q16,\"CE\")>=1,\"OK\",\"\")","v":""},{"$f":"IF(COUNTIF($F16:$Q16,\"CR\")>=1,\"OK\",\"\")","v":"OK"},{"$f":"IF(COUNTIF($F16:$Q16,\"MP\")>=1,\"OK\",\"\")","v":"OK"}]
["NEURO RAD.","TUBE RX","200405184",{"$nulls":8},"MP",{"$nulls":5},{"$f":"IF(COUNTIF($F17:$Q17,\"CI\")>=1,\"OK\",\"\")","v":""},{"$f":"IF(COUNTIF($F17:$Q17,\"CE\")>=1,\"OK\",\"\")","v":""},{"$f":"IF(COUNTIF($F17:$Q17,\"CR\")>=1,\"OK\",\"\")","v":""},{"$f":"IF(COUNTIF($F17:$Q17,\"MP\")>=1,\"OK\",\"\")","v":"OK"}]
[{"$nulls":17},{"$f":"COUNTIF(R13:R17,\"OK\")/COUNTA(R13:R17)","v":{"v":0.2,"d":"20.0%"}},{"$f":"COUNTIF(S13:S17,\"OK\")/COUNTA(S13:S17)","v":{"v":0.2,"d":"20.0%"}},{"$f":"COUNTIF(T13:T17,\"OK\")/COUNTA(T13:T17)","v":{"v":0.4,"d":"40.0%"}},{"$f":"COUNTIF(U13:U17,\"OK\")/COUNTA(U13:U17)","v":{"v":0.6,"d":"60.0%"}},{"$f":"COUNTIF(R13:U17,\"<>OK\")/COUNTA(R13:U17)","v":{"v":0.65,"d":"65.0%"}}]
["ARRET","TABLE DE RADIOLOGIE","9805309","Arrêt",92100,{"$nulls":12},{"$f":"IF(COUNTIF($F19:$Q19,\"CI\")>=1,\"OK\",\"\")","v":""},{"$f":"IF(COUNTIF($F19:$Q19,\"CE\")>=1,\"OK\",\"\")","v":""},{"$f":"IF(COUNTIF($F19:$Q19,\"CR\")>=1,\"OK\",\"\")","v":""},{"$f":"IF(COUNTIF($F19:$Q19,\"MP\")>=1,\"OK\",\"\")","v":""}]
["ARRET","GENERATEUR DE RADIOLOGIE","9805310",{"$nulls":14},{"$f":"IF(COUNTIF($F20:$Q20,\"CI\")>=1,\"OK\",\"\")","v":""},{"$f":"IF(COUNTIF($F20:$Q20,\"CE\")>=1,\"OK\",\"\")","v":""},{"$f":"IF(COUNTIF($F20:$Q20,\"CR\")>=1,\"OK\",\"\")","v":""},{"$f":"IF(COUNTIF($F20:$Q20,\"MP\")>=1,\"OK\",\"\")","v":""}]
["ARRET","TUBE RX","9805311",{"$nulls":14},{"$f":"IF(COUNTIF($F21:$Q21,\"CI\")>=1,\"OK\",\"\")","v":""},{"$f":"IF(COUNTIF($F21:$Q21,\"CE\")>=1,\"OK\",\"\")","v":""},{"$f":"IF(COUNTIF($F21:$Q21,\"CR\")>=1,\"OK\",\"\")","v":""},{"$f":"IF(COUNTIF($F21:$Q21,\"MP\")>=1,\"OK\",\"\")","v":""}]
[{"$nulls":17},{"$f":"COUNTIF(R19:R21,\"OK\")/COUNTA(R19:R21)","v":{"v":0,"d":"0.0%"}},{"$f":"COUNTIF(S19:S21,\"OK\")/COUNTA(S19:S21)","v":{"v":0,"d":"0.0%"}},{"$f":"COUNTIF(T19:T21,\"OK\")/COUNTA(T19:T21)","v":{"v":0,"d":"0.0%"}},{"$f":"COUNTIF(U19:U21,\"OK\")/COUNTA(U19:U21)","v":{"v":0,"d":"0.0%"}},{"$f":"COUNTIF(R19:U21,\"<>OK\")/COUNTA(R19:U21)","v":{"v":1,"d":"100.0%"}}]
["Secteur","Description des matériels"," INVENTAIRE","SALLE","N°SYSTEME","Janv.","Fevr.","Mars","Avril ","Mai","Juin","Juillet","Août","Sept.","Oct.","Nov.","Déc.","CI","CE","CR","MP"]
["RADIO Clém.","SUSPENSION PORTE-TUBE","200005069","Salle 1C",104021,{"$nulls":12},{"$f":"IF(COUNTIF($F24:$Q24,\"CI\")>=1,\"OK\",\"\")","v":""},{"$f":"IF(COUNTIF($F24:$Q24,\"CE\")>=1,\"OK\",\"\")","v":""},{"$f":"IF(COUNTIF($F24:$Q24,\"CR\")>=1,\"OK\",\"\")","v":""},{"$f":"IF(COUNTIF($F24:$Q24,\"MP\")>=1,\"OK\",\"\")","v":""}]
["RADIO Clém.","TABLE DE RADIOLOGIE","200205134",{"$nulls":14},{"$f":"IF(COUNTIF($F25:$Q25,\"CI\")>=1,\"OK\",\"\")","v":""},{"$f":"IF(COUNTIF($F25:$Q25,\"CE\")>=1,\"OK\",\"\")","v":""},{"$f":"IF(COUNTIF($F25:$Q25,\"CR\")>=1,\"OK\",\"\")","v":""},{"$f":"IF(COUNTIF($F25:$Q25,\"MP\")>=1,\"OK\",\"\")","v":""}]
["RADIO Clém.","GENERATEUR DE RADIOLOGIE","200205135",{"$nulls":14},{"$f":"IF(COUNTIF($F26:$Q26,\"CI\")>=1,\"OK\",\"\")","v":""},{"$f":"IF(COUNTIF($F26:$Q26,\"CE\")>=1,\"OK\",\"\")","v":""},{"$f":"IF(COUNTIF($F26:$Q26,\"CR\")>=1,\"OK\",\"\")","v":""},{"$f":"IF(COUNTIF($F26:$Q26,\"MP\")>=1,\"OK\",\"\")","v":""}]
["RADIO Clém.","TUBE RX","200205136",{"$nulls":14},{"$f":"IF(COUNTIF($F27:$Q27,\"CI\")>=1,\"OK\",\"\")","v":""},{"$f":"IF(COUNTIF($F27:$Q27,\"CE\")>=1,\"OK\",\"\")","v":""},{"$f":"IF(COUNTIF($F27:$Q27,\"CR\")>=1,\"OK\",\"\")","v":""},{"$f":"IF(COUNTIF($F27:$Q27,\"MP\")>=1,\"OK\",\"\")","v":""}]
[{"$nulls":17},{"$f":"COUNTIF(R24:R27,\"OK\")/COUNTA(R24:R27)","v":{"v":0,"d":"0.0%"}},{"$f":"COUNTIF(S24:S27,\"OK\")/COUNTA(S24:S27)","v":{"v":0,"d":"0.0%"}},{"$f":"COUNTIF(T24:T27,\"OK\")/COUNTA(T24:T27)","v":{"v":0,"d":"0.0%"}},{"$f":"COUNTIF(U24:U27,\"OK\")/COUNTA(U24:U27)","v":{"v":0,"d":"0.0%"}},{"$f":"COUNTIF(R24:U27,\"<>OK\")/COUNTA(R24:U27)","v":{"v":1,"d":"100.0%"}}]
["CARDIO","ARCEAU AU SOL CAPTEUR PLAN","200805322","Coro1",60397781,{"$nulls":12},{"$f":"IF(COUNTIF($F29:$Q29,\"CI\")>=1,\"OK\",\"\")","v":""},{"$f":"IF(COUNTIF($F29:$Q29,\"CE\")>=1,\"OK\",\"\")","v":""},{"$f":"IF(COUNTIF($F29:$Q29,\"CR\")>=1,\"OK\",\"\")","v":""},{"$f":"IF(COUNTIF($F29:$Q29,\"MP\")>=1,\"OK\",\"\")","v":""}]
["CARDIO","GENERATEUR DE RADIOLOGIE","200805322A",{"$nulls":14},{"$f":"IF(COUNTIF($F30:$Q30,\"CI\")>=1,\"OK\",\"\")","v":""},{"$f":"IF(COUNTIF($F30:$Q30,\"CE\")>=1,\"OK\",\"\")","v":""},{"$f":"IF(COUNTIF($F30:$Q30,\"CR\")>=1,\"OK\",\"\")","v":""},{"$f":"IF(COUNTIF($F30:$Q30,\"MP\")>=1,\"OK\",\"\")","v":""}]
["CARDIO","TUBE RX","200805322A",{"$nulls":14},{"$f":"IF(COUNTIF($F31:$Q31,\"CI\")>=1,\"OK\",\"\")","v":""},{"$f":"IF(COUNTIF($F31:$Q31,\"CE\")>=1,\"OK\",\"\")","v":""},{"$f":"IF(COUNTIF($F31:$Q31,\"CR\")>=1,\"OK\",\"\")","v":""},{"$f":"IF(COUNTIF($F31:$Q31,\"MP\")>=1,\"OK\",\"\")","v":""}]
[{"$nulls":17},{"$f":"COUNTIF(R29:R31,\"OK\")/COUNTA(R29:R31)","v":{"v":0,"d":"0.0%"}},{"$f":"COUNTIF(S29:S31,\"OK\")/COUNTA(S29:S31)","v":{"v":0,"d":"0.0%"}},{"$f":"COUNTIF(T29:T31,\"OK\")/COUNTA(T29:T31)","v":{"v":0,"d":"0.0%"}},{"$f":"COUNTIF(U29:U31,\"OK\")/COUNTA(U29:U31)","v":{"v":0,"d":"0.0%"}},{"$f":"COUNTIF(R29:U31,\"<>OK\")/COUNTA(R29:U31)","v":{"v":1,"d":"100.0%"}}]
["CARDIO","ARCEAU AU SOL CAPTEUR PLAN","200805589","Coro2",60561091,{"$nulls":12},{"$f":"IF(COUNTIF($F33:$Q33,\"CI\")>=1,\"OK\",\"\")","v":""},{"$f":"IF(COUNTIF($F33:$Q33,\"CE\")>=1,\"OK\",\"\")","v":""},{"$f":"IF(COUNTIF($F33:$Q33,\"CR\")>=1,\"OK\",\"\")","v":""},{"$f":"IF(COUNTIF($F33:$Q33,\"MP\")>=1,\"OK\",\"\")","v":""}]
["CARDIO","GENERATEUR DE RADIOLOGIE","200805589A",{"$nulls":14},{"$f":"IF(COUNTIF($F34:$Q34,\"CI\")>=1,\"OK\",\"\")","v":""},{"$f":"IF(COUNTIF($F34:$Q34,\"CE\")>=1,\"OK\",\"\")","v":""},{"$f":"IF(COUNTIF($F34:$Q34,\"CR\")>=1,\"OK\",\"\")","v":""},{"$f":"IF(COUNTIF($F34:$Q34,\"MP\")>=1,\"OK\",\"\")","v":""}]
["CARDIO","TUBE RX","200805589B",{"$nulls":14},{"$f":"COUNTIF(R33:R34,\"OK\")/COUNTA(R33:R34)","v":{"v":0,"d":"0.0%"}},{"$f":"COUNTIF(S33:S34,\"OK\")/COUNTA(S33:S34)","v":{"v":0,"d":"0.0%"}},{"$f":"COUNTIF(T33:T34,\"OK\")/COUNTA(T33:T34)","v":{"v":0,"d":"0.0%"}},{"$f":"COUNTIF(U33:U34,\"OK\")/COUNTA(U33:U34)","v":{"v":0,"d":"0.0%"}},{"$f":"COUNTIF(R33:U34,\"<>OK\")/COUNTA(R33:U34)","v":{"v":1,"d":"100.0%"}}]

{"sheet":"Siemens","index":2,"n_rows":73,"n_cols":22,"rows_kept":73,"merged":[[1,0,1,20],[21,4,27,4],[30,4,35,4],[38,4,44,4],[47,4,50,4],[53,4,59,4],[62,4,66,4],[69,4,71,4]]}
[]
[" CONTRÔLES D'EQUIPEMENTS SIEMENS EFFECTUES"]
[]
["CI","Contrôle interne"]
["CE","Contrôle externe"]
["CR","Contrôle radioprotection"]
["MP","Maintenance préventive"]
[]
["Secteur","Description des matériels"," INVENTAIRE","SALLE","N°SYSTEME","Janv.","Fevr.","Mars","Avril ","Mai","Juin","Juillet","Août","Sept.","Oct.","Nov.","Déc.","CI","CE","CR","MP"]
["RADIO FEH","MOBILE DE RADIOGRAPHIE","8700965","Hémato.","L016827",{"$nulls":12},{"$f":"IF(COUNTIF($F10:$Q10,\"CI\")>=1,\"OK\",\"\")","v":""},{"$f":"IF(COUNTIF($F10:$Q10,\"CE\")>=1,\"OK\",\"\")","v":""},{"$f":"IF(COUNTIF($F10:$Q10,\"CR\")>=1,\"OK\",\"\")","v":""},{"$f":"IF(COUNTIF($F10:$Q10,\"MP\")>=1,\"OK\",\"\")","v":""}]
["RADIO FEH","MOBILE DE RADIOGRAPHIE","8700966","Hémato.","L016828",{"$nulls":12},"","","",""]
["RADIO Clém.","MOBILE DE RADIOGRAPHIE","200205649","Néphro.","L026161",{"$nulls":7},"MP",{"$nulls":4},"","","","OK"]
["RADIO Clém.","MOBILE DE RADIOGRAPHIE","9805538","Pediatrie","L021238",{"$nulls":5},"CE",{"$nulls":6},"","OK","",""]
["FEH","MOBILE DE RADIOGRAPHIE",200805584,"Néonat.","L030921",{"$nulls":7},"CI",{"$nulls":4},"OK","","",""]
["DATU","MOBILE DE RADIOGRAPHIE",200805585,"Datu","L030920",{"$nulls":12},"","","",""]
["Médecine Légale","MOBILE DE RADIOGRAPHIE",200805586,"Médecine légale","L030919",{"$nulls":12},"","","",""]
[{"$nulls":17},{"$f":"COUNTIF(R10:R16,\"OK\")/COUNTA(R10:R16)","v":{"v":0.14285714285714285,"d":"14.3%"}},{"$f":"COUNTIF(S10:S16,\"OK\")/COUNTA(S10:S16)","v":{"v":0.14285714285714285,"d":"14.3%"}},{"$f":"COUNTIF(T10:T16,\"OK\")/COUNTA(T10:T16)","v":{"v":0,"d":"0.0%"}},{"$f":"COUNTIF(U10:U16,\"OK\")/COUNTA(U10:U16)","v":{"v":0.14285714285714285,"d":"14.3%"}},{"$f":"COUNTIF(R10:U16,\"<>OK\")/COUNTA(R10:U16)","v":{"v":0.8928571428571429,"d":"89.3%"}}]
["GASTRO","MOBILE DE RADIOSCOPIE","200105125","Gastro.","L023153",{"$nulls":12},{"$f":"IF(COUNTIF($F18:$Q18,\"CI\")>=1,\"OK\",\"\")","v":""},{"$f":"IF(COUNTIF($F18:$Q18,\"CE\")>=1,\"OK\",\"\")","v":""},{"$f":"IF(COUNTIF($F18:$Q18,\"CR\")>=1,\"OK\",\"\")","v":""},{"$f":"IF(COUNTIF($F18:$Q18,\"MP\")>=1,\"OK\",\"\")","v":""}]
["BLOC12","MOBILE DE RADIOSCOPIE","200405119","Bloc 12","L027169",{"$nulls":12},{"$f":"IF(COUNTIF($F19:$Q19,\"CI\")>=1,\"OK\",\"\")","v":""},{"$f":"IF(COUNTIF($F19:$Q19,\"CE\")>=1,\"OK\",\"\")","v":""},{"$f":"IF(COUNTIF($F19:$Q19,\"CR\")>=1,\"OK\",\"\")","v":""},{"$f":"IF(COUNTIF($F19:$Q19,\"MP\")>=1,\"OK\",\"\")","v":""}]
[{"$nulls":17},{"$f":"COUNTIF(R18:R19,\"OK\")/COUNTA(R18:R19)","v":{"v":0,"d":"0.0%"}},{"$f":"COUNTIF(S18:S19,\"OK\")/COUNTA(S18:S19)","v":{"v":0,"d":"0.0%"}},{"$f":"COUNTIF(T18:T19,\"OK\")/COUNTA(T18:T19)","v":{"v":0,"d":"0.0%"}},{"$f":"COUNTIF(U18:U19,\"OK\")/COUNTA(U18:U19)","v":{"v":0,"d":"0.0%"}},{"$f":"COUNTIF(R18:U19,\"<>OK\")/COUNTA(R18:U19)","v":{"v":1,"d":"100.0%"}}]
["Secteur","Description des matériels"," INVENTAIRE","SALLE","N°SYSTEME","Janv.","Fevr.","Mars","Avril ","Mai","Juin","Juillet","Août","Sept.","Oct.","Nov.","Déc.","CI","CE","CR","MP"]
["RADIO","TABLE TELECOMMANDEE NUM. A H V","200105131","Salle 4 Iconos","R026815",{"$nulls":12},{"$f":"IF(COUNTIF($F22:$Q22,\"CI\")>=1,\"OK\",\"\")","v":""},{"$f":"IF(COUNTIF($F22:$Q22,\"CE\")>=1,\"OK\",\"\")","v":""},{"$f":"IF(COUNTIF($F22:$Q22,\"CR\")>=1,\"OK\",\"\")","v":""},{"$f":"IF(COUNTIF($F22:$Q22,\"MP\")>=1,\"OK\",\"\")","v":""}]
["RADIO","GENERATEUR DE RADIOLOGIE","200105132","Salle 4 Iconos",{"$nulls":13},"","","",""]
["RADIO","SYSTEME DE RADIOLOGIE NUMERISEE","200105135","Salle 4 Iconos",{"$nulls":13},"","","",""]
["RADIO","SUSPENSION PORTE-TUBE","200105136","Salle 4 Iconos",{"$nulls":13},"","","",""]
["RADIO","POTTER MURAL","200105138","Salle 4 Iconos",{"$nulls":13},"","","",""]
["RADIO","TUBE RX","200105133","Salle 4 Iconos",{"$nulls":13},"","","",""]
["RADIO","TUBE RX","200105137","Salle 4 Iconos",{"$nulls":13},"","","",""]
[{"$nulls":17},{"$f":"COUNTIF(R22:R28,\"OK\")/COUNTA(R22:R28)","v":{"v":0,"d":"0.0%"}},{"$f":"COUNTIF(S22:S28,\"OK\")/COUNTA(S22:S28)","v":{"v":0,"d":"0.0%"}},{"$f":"COUNTIF(T22:T28,\"OK\")/COUNTA(T22:T28)","v":{"v":0,"d":"0.0%"}},{"$f":"COUNTIF(U22:U28,\"OK\")/COUNTA(U22:U28)","v":{"v":0,"d":"0.0%"}},{"$f":"COUNTIF(R22:U28,\"<>OK\")/COUNTA(R22:U28)","v":{"v":1,"d":"100.0%"}}]
["Secteur","Description des matériels"," INVENTAIRE","SALLE","N°SYSTEME","Janv.","Fevr.","Mars","Avril ","Mai","Juin","Juillet","Août","Sept.","Oct.","Nov.","Déc.","CI","CE","CR","MP"]
["RADIO","TABLE TELECOMMANDEE CAPTEUR PLAN ","200905066","Salle 5","R031037",{"$nulls":12},{"$f":"IF(COUNTIF($F31:$Q31,\"CI\")>=1,\"OK\",\"\")","v":""},{"$f":"IF(COUNTIF($F31:$Q31,\"CE\")>=1,\"OK\",\"\")","v":""},{"$f":"IF(COUNTIF($F31:$Q31,\"CR\")>=1,\"OK\",\"\")","v":""},{"$f":"IF(COUNTIF($F31:$Q31,\"MP\")>=1,\"OK\",\"\")","v":""}]
["RADIO","GENERATEUR DE RADIOLOGIE",200905067,"Salle 5",{"$nulls":13},"","","",""]
["RADIO","TUBE RX",200905068,"Salle 5",{"$nulls":13},"","","",""]
["RADIO","SUSPENSION PORTE-TUBE",200905069,"Salle 5",{"$nulls":13},"","","",""]
["RADIO","GENERATEUR DE RADIOLOGIE",200905070,"Salle 5",{"$nulls":13},"","","",""]
["RADIO","TUBE RX ",200905071,"Salle 5",{"$nulls":13},"","","",""]
[{"$nulls":17},{"$f":"COUNTIF(R31:R36,\"OK\")/COUNTA(R31:R36)","v":{"v":0,"d":"0.0%"}},{"$f":"COUNTIF(S31:S36,\"OK\")/COUNTA(S31:S36)","v":{"v":0,"d":"0.0%"}},{"$f":"COUNTIF(T31:T36,\"OK\")/COUNTA(T31:T36)","v":{"v":0,"d":"0.0%"}},{"$f":"COUNTIF(U31:U36,\"OK\")/COUNTA(U31:U36)","v":{"v":0,"d":"0.0%"}},{"$f":"COUNTIF(R31:U36,\"<>OK\")/COUNTA(R31:U36)","v":{"v":1,"d":"100.0%"}}]
["Secteur","Description des matériels"," INVENTAIRE","SALLE","N°SYSTEME","Janv.","Fevr.","Mars","Avril ","Mai","Juin","Juillet","Août","Sept.","Oct.","Nov.","Déc.","CI","CE","CR","MP"]
["RADIO","TABLE TELECOMMANDEE NUM. à H V","200105143","Salle 6 Iconos","R026548",{"$nulls":12},{"$f":"IF(COUNTIF($F39:$Q39,\"CI\")>=1,\"OK\",\"\")","v":""},{"$f":"IF(COUNTIF($F39:$Q39,\"CE\")>=1,\"OK\",\"\")","v":""},{"$f":"IF(COUNTIF($F39:$Q39,\"CR\")>=1,\"OK\",\"\")","v":""},{"$f":"IF(COUNTIF($F39:$Q39,\"MP\")>=1,\"OK\",\"\")","v":""}]
["RADIO","GENERATEUR DE RADIOLOGIE","200105144","Salle 6 Iconos",{"$nulls":13},"","","",""]
["RADIO","SYSTEME DE RADIOLOGIE NUMERISEE","200105147","Salle 6 Iconos",{"$nulls":13},"","","",""]
["RADIO","SUSPENSION PORTE-TUBE","200105148","Salle 6 Iconos",{"$nulls":13},"","","",""]
["RADIO","POTTER MURAL","200105150","Salle 6 Iconos",{"$nulls":13},"","","",""]
["RADIO","TUBE RX","200105145","Salle 6 Iconos",{"$nulls":13},"","","",""]
["RADIO","TUBE RX","200105149","Salle 6 Iconos",{"$nulls":13},"","","",""]
[{"$nulls":17},{"$f":"COUNTIF(R39:R45,\"OK\")/COUNTA(R39:R45)","v":{"v":0,"d":"0.0%"}},{"$f":"COUNTIF(S39:S45,\"OK\")/COUNTA(S39:S45)","v":{"v":0,"d":"0.0%"}},{"$f":"COUNTIF(T39:T45,\"OK\")/COUNTA(T39:T45)","v":{"v":0,"d":"0.0%"}},{"$f":"COUNTIF(U39:U45,\"OK\")/COUNTA(U39:U45)","v":{"v":0,"d":"0.0%"}},{"$f":"COUNTIF(R39:U45,\"<>OK\")/COUNTA(R39:U45)","v":{"v":1,"d":"100.0%"}}]
["Secteur","Description des matériels"," INVENTAIRE","SALLE","N°SYSTEME","Janv.","Fevr.","Mars","Avril ","Mai","Juin","Juillet","Août","Sept.","Oct.","Nov.","Déc.","CI","CE","CR","MP"]
["RADIO","TABLE ARCEAU","9705531","Salle 8 Polystar","V020140",{"$nulls":12},{"$f":"IF(COUNTIF($F48:$Q48,\"CI\")>=1,\"OK\",\"\")","v":""},{"$f":"IF(COUNTIF($F48:$Q48,\"CE\")>=1,\"OK\",\"\")","v":""},{"$f":"IF(COUNTIF($F48:$Q48,\"CR\")>=1,\"OK\",\"\")","v":""},{"$f":"IF(COUNTIF($F48:$Q48,\"MP\")>=1,\"OK\",\"\")","v":""}]
["RADIO","GENERATEUR DE RADIOLOGIE","9705532","Salle 8 Polystar",{"$nulls":13},{"$f":"IF(COUNTIF($F49:$Q49,\"CI\")>=1,\"OK\",\"\")","v":""},{"$f":"IF(COUNTIF($F49:$Q49,\"CE\")>=1,\"OK\",\"\")","v":""},{"$f":"IF(COUNTIF($F49:$Q49,\"CR\")>=1,\"OK\",\"\")","v":""},{"$f":"IF(COUNTIF($F49:$Q49,\"MP\")>=1,\"OK\",\"\")","v":""}]
["RADIO","SYSTEME DE RADIOGRAPHIE NUMERIQUE","9705534","Salle 8 Polystar",{"$nulls":13},{"$f":"IF(COUNTIF($F50:$Q50,\"CI\")>=1,\"OK\",\"\")","v":""},{"$f":"IF(COUNTIF($F50:$Q50,\"CE\")>=1,\"OK\",\"\")","v":""},{"$f":"IF(COUNTIF($F50:$Q50,\"CR\")>=1,\"OK\",\"\")","v":""},{"$f":"IF(COUNTIF($F50:$Q50,\"MP\")>=1,\"OK\",\"\")","v":""}]
["RADIO","TUBE RX","9705533","Salle 8 Polystar",{"$nulls":13},{"$f":"IF(COUNTIF($F51:$Q51,\"CI\")>=1,\"OK\",\"\")","v":""},{"$f":"IF(COUNTIF($F51:$Q51,\"CE\")>=1,\"OK\",\"\")","v":""},{"$f":"IF(COUNTIF($F51:$Q51,\"CR\")>=1,\"OK\",\"\")","v":""},{"$f":"IF(COUNTIF($F51:$Q51,\"MP\")>=1,\"OK\",\"\")","v":""}]
[{"$nulls":17},{"$f":"COUNTIF(R48:R51,\"OK\")/COUNTA(R48:R51)","v":{"v":0,"d":"0.0%"}},{"$f":"COUNTIF(S48:S51,\"OK\")/COUNTA(S48:S51)","v":{"v":0,"d":"0.0%"}},{"$f":"COUNTIF(T48:T51,\"OK\")/COUNTA(T48:T51)","v":{"v":0,"d":"0.0%"}},{"$f":"COUNTIF(U48:U51,\"OK\")/COUNTA(U48:U51)","v":{"v":0,"d":"0.0%"}},{"$f":"COUNTIF(R48:U51,\"<>OK\")/COUNTA(R48:U51)","v":{"v":1,"d":"100.0%"}}]
["Secteur","Description des matériels"," INVENTAIRE","SALLE","N°SYSTEME","Janv.","Fevr.","Mars","Avril ","Mai","Juin","Juillet","Août","Sept.","Oct.","Nov.","Déc.","CI","CE","CR","MP"]
["RADIO","TABLE TELECOMMANDEE","9200981","Salle 9","R016760",{"$nulls":12},{"$f":"IF(COUNTIF($F54:$Q54,\"CI\")>=1,\"OK\",\"\")","v":""},{"$f":"IF(COUNTIF($F54:$Q54,\"CE\")>=1,\"OK\",\"\")","v":""},{"$f":"IF(COUNTIF($F54:$Q54,\"CR\")>=1,\"OK\",\"\")","v":""},{"$f":"IF(COUNTIF($F54:$Q54,\"MP\")>=1,\"OK\",\"\")","v":""}]
["RADIO","GENERATEUR DE RADIOLOGIE","9200982","Salle 9",{"$nulls":13},"","","",""]
["RADIO","SUSPENSION PORTE-TUBE","9200986","Salle 9",{"$nulls":13},"","","",""]
["RADIO","TUBE RX","9200985A","Salle 9",{"$nulls":13},"","","",""]
["RADIO","GAINE RX","9200985B","Salle 9",{"$nulls":13},"","","",""]
["RADIO","TUBE RX","9200986A","Salle 9",{"$nulls":13},"","","",""]
["RADIO","GAINE RX","9200986B","Salle 9",{"$nulls":13},"","","",""]
[{"$nulls":17},{"$f":"COUNTIF(R54:R60,\"OK\")/COUNTA(R54:R60)","v":{"v":0,"d":"0.0%"}},{"$f":"COUNTIF(S54:S60,\"OK\")/COUNTA(S54:S60)","v":{"v":0,"d":"0.0%"}},{"$f":"COUNTIF(T54:T60,\"OK\")/COUNTA(T54:T60)","v":{"v":0,"d":"0.0%"}},{"$f":"COUNTIF(U54:U60,\"OK\")/COUNTA(U54:U60)","v":{"v":0,"d":"0.0%"}},{"$f":"COUNTIF(R54:U60,\"<>OK\")/COUNTA(R54:U60)","v":{"v":1,"d":"100.0%"}}]
["Secteur","Description des matériels"," INVENTAIRE","SALLE","N°SYSTEME","Janv.","Fevr.","Mars","Avril ","Mai","Juin","Juillet","Août","Sept.","Oct.","Nov.","Déc.","CI","CE","CR","MP"]
["NEURO RAD.","TABLE ARCEAU","9405922","S. Polystar Neuro","V016076",{"$nulls":12},{"$f":"IF(COUNTIF($F63:$Q63,\"CI\")>=1,\"OK\",\"\")","v":""},{"$f":"IF(COUNTIF($F63:$Q63,\"CE\")>=1,\"OK\",\"\")","v":""},{"$f":"IF(COUNTIF($F63:$Q63,\"CR\")>=1,\"OK\",\"\")","v":""},{"$f":"IF(COUNTIF($F63:$Q63,\"MP\")>=1,\"OK\",\"\")","v":""}]
["NEURO RAD.","GENERATEUR DE RADIOLOGIE","9405923","S. Polystar Neuro",{"$nulls":13},{"$f":"IF(COUNTIF($F64:$Q64,\"CI\")>=1,\"OK\",\"\")","v":""},{"$f":"IF(COUNTIF($F64:$Q64,\"CE\")>=1,\"OK\",\"\")","v":""},{"$f":"IF(COUNTIF($F64:$Q64,\"CR\")>=1,\"OK\",\"\")","v":""},{"$f":"IF(COUNTIF($F64:$Q64,\"MP\")>=1,\"OK\",\"\")","v":""}]
["NEURO RAD.","SYSTEME D'ANGIOGRAPHIE NUMERIQUE","9405924","S. Polystar Neuro",{"$nulls":13},{"$f":"IF(COUNTIF($F65:$Q65,\"CI\")>=1,\"OK\",\"\")","v":""},{"$f":"IF(COUNTIF($F65:$Q65,\"CE\")>=1,\"OK\",\"\")","v":""},{"$f":"IF(COUNTIF($F65:$Q65,\"CR\")>=1,\"OK\",\"\")","v":""},{"$f":"IF(COUNTIF($F65:$Q65,\"MP\")>=1,\"OK\",\"\")","v":""}]
["NEURO RAD.","TUBE RX","9405922A","S. Polystar Neuro",{"$nulls":13},{"$f":"IF(COUNTIF($F66:$Q66,\"CI\")>=1,\"OK\",\"\")","v":""},{"$f":"IF(COUNTIF($F66:$Q66,\"CE\")>=1,\"OK\",\"\")","v":""},{"$f":"IF(COUNTIF($F66:$Q66,\"CR\")>=1,\"OK\",\"\")","v":""},{"$f":"IF(COUNTIF($F66:$Q66,\"MP\")>=1,\"OK\",\"\")","v":""}]
["NEURO RAD.","GAINE RX","9405922B","S. Polystar Neuro",{"$nulls":13},{"$f":"IF(COUNTIF($F67:$Q67,\"CI\")>=1,\"OK\",\"\")","v":""},{"$f":"IF(COUNTIF($F67:$Q67,\"CE\")>=1,\"OK\",\"\")","v":""},{"$f":"IF(COUNTIF($F67:$Q67,\"CR\")>=1,\"OK\",\"\")","v":""},{"$f":"IF(COUNTIF($F67:$Q67,\"MP\")>=1,\"OK\",\"\")","v":""}]
[{"$nulls":17},{"$f":"COUNTIF(R63:R67,\"OK\")/COUNTA(R63:R67)","v":{"v":0,"d":"0.0%"}},{"$f":"COUNTIF(S63:S67,\"OK\")/COUNTA(S63:S67)","v":{"v":0,"d":"0.0%"}},{"$f":"COUNTIF(T63:T67,\"OK\")/COUNTA(T63:T67)","v":{"v":0,"d":"0.0%"}},{"$f":"COUNTIF(U63:U67,\"OK\")/COUNTA(U63:U67)","v":{"v":0,"d":"0.0%"}},{"$f":"COUNTIF(R63:U67,\"<>OK\")/COUNTA(R63:U67)","v":{"v":1,"d":"100.0%"}}]
["Secteur","Description des matériels"," INVENTAIRE","SALLE","N°SYSTEME","Janv.","Fevr.","Mars","Avril ","Mai","Juin","Juillet","Août","Sept.","Oct.","Nov.","Déc.","CI","CE","CR","MP"]
["FEH","TABLE TELECOMMANDEE CAPTEUR PLAN","200805302","Salle FEH","R030997",{"$nulls":12},{"$f":"IF(COUNTIF($F70:$Q70,\"CI\")>=1,\"OK\",\"\")","v":""},{"$f":"IF(COUNTIF($F70:$Q70,\"CE\")>=1,\"OK\",\"\")","v":""},{"$f":"IF(COUNTIF($F70:$Q70,\"CR\")>=1,\"OK\",\"\")","v":""},{"$f":"IF(COUNTIF($F70:$Q70,\"MP\")>=1,\"OK\",\"\")","v":""}]
["FEH","GENERATEUR DE RADIOLOGIE","200805302A","Salle FEH",{"$nulls":13},{"$f":"IF(COUNTIF($F71:$Q71,\"CI\")>=1,\"OK\",\"\")","v":""},{"$f":"IF(COUNTIF($F71:$Q71,\"CE\")>=1,\"OK\",\"\")","v":""},{"$f":"IF(COUNTIF($F71:$Q71,\"CR\")>=1,\"OK\",\"\")","v":""},{"$f":"IF(COUNTIF($F71:$Q71,\"MP\")>=1,\"OK\",\"\")","v":""}]
["FEH","TUBE RX","200805302B","Salle FEH",{"$nulls":13},{"$f":"IF(COUNTIF($F72:$Q72,\"CI\")>=1,\"OK\",\"\")","v":""},{"$f":"IF(COUNTIF($F72:$Q72,\"CE\")>=1,\"OK\",\"\")","v":""},{"$f":"IF(COUNTIF($F72:$Q72,\"CR\")>=1,\"OK\",\"\")","v":""},{"$f":"IF(COUNTIF($F72:$Q72,\"MP\")>=1,\"OK\",\"\")","v":""}]
[{"$nulls":17},{"$f":"COUNTIF(R70:R72,\"OK\")/COUNTA(R70:R72)","v":{"v":0,"d":"0.0%"}},{"$f":"COUNTIF(S70:S72,\"OK\")/COUNTA(S70:S72)","v":{"v":0,"d":"0.0%"}},{"$f":"COUNTIF(T70:T72,\"OK\")/COUNTA(T70:T72)","v":{"v":0,"d":"0.0%"}},{"$f":"COUNTIF(U70:U72,\"OK\")/COUNTA(U70:U72)","v":{"v":0,"d":"0.0%"}},{"$f":"COUNTIF(R70:U72,\"<>OK\")/COUNTA(R70:U72)","v":{"v":1,"d":"100.0%"}}]