{"text_format":"1","workbook":"xlsx","n_sheets":7,"sheets":["1- Mode d'emploi","2- Article 3","3- Article 4","4- Article 5","5- Résultats Article 4","6- Résultats Article 5","7- Résultat Global"],"not_rendered":{"charts":5,"images":1,"macros":1,"external_links":3,"defined_names":9,"comments":0,"pivot_tables":0},"unopened":[],"bounds":{"document_bytes":16777216,"sheet_cells":100000,"rows_first":2000,"rows_last":500,"rows_between":2000,"halvings":0,"cell_chars":16384,"cell_head_chars":4096},"cells_cut":0,"cells_raw":0,"read":"whole","date_system":"1900"}

{"sheet":"1- Mode d'emploi","index":0,"n_rows":32,"n_cols":14,"rows_kept":32,"cut":false,"hidden":false,"merged":[[20,7,20,8],[18,7,18,8],[17,7,17,8],[16,7,16,8],[6,12,7,12],[9,0,12,8],[15,0,15,3],[15,4,15,8],[19,0,19,1],[19,7,19,8],[20,0,20,1],[16,0,16,1],[17,0,17,1],[18,0,18,1],[1,2,1,8],[2,2,2,8],[3,0,3,2],[3,3,3,8],[5,0,5,2],[4,0,4,2],[4,3,4,8],[5,4,5,6]]}
["Document d'autodiagnostic en référence à la norme ISO 31000:2009"]
[null,null,"   Autodiagnostic  de la norme ISO 31000:2009"]
[]
["Etablissement:",null,null,"-"]
[" Responsable du SMQ: ",null,null,"-"]
[" Contact du Responsable du SMQ:",null,null," @: ",null,null,null," Tél:",null,null,null,null,"Sommaire Dynamique de la Grille d'évaluation"]
[null,null,null,null,null,null,null,null,null,null,null,null,"Ce sommaire dynamique vous dirigera directement au niveau du chapitre de l'ISO 31000:2009sur lequel vous désirez travailler. "]
["Manuel d'emploi"]
[]
["Objectif :\nCet outil permet aux différentes organisations de type PME/TPI de se positionner par rapport à leurs besoins et capacités en matière du management du risque et ainsi évaluer la Respect de ce système de management selon les conseils de la norme ISO 31000:2009. Cet outil sert aussi de cahier de bord dans lequel il est possible d’évaluer et de commenter la progression du système de management du risque. Grâce à cet outil vous aurez plus de visibilité afin d’émettre des actions correctives mais aussi préventives dans une démarche d’amélioration continue.\n(Cet outil n’est pas un outil de certification)\n\n \nPrésentation des éléments :\nUn sommaire dynamique permet de se rendre directement au volet voulu. Cet outil Excel est constitué de plusieurs onglets :\nLe diagnostic : Chaque chapitre est traité indépendamment dans un onglet.\nLes résultats du chapitre : Une fiche synthétique regroupant les données émises lors du diagnostic sur chaque chapitre, schématisées sous forme de graphes radar.\nLe résultat global : Tous les résultats sont réunis sur cet onglet en donnant une vision sur la globalité du système de management du risque.\n"]
[]
[]
[]
[]
["Échelles d'évaluation utilisées paramétrables"]
["Niveaux de VÉRACITÉ quant à la RÉALISATION \ndes actions associées aux conseils de la norme",null,null,null,"LIBELLÉS des niveaux de Respect \ndes ARTICLES de la norme "]
["Niveaux de VÉRACITÉ",null,"Choix","Taux de \nVÉRACITÉ","Taux moyen \nMinimal","Taux moyen\nMaximal","Niveaux de Respect","Explicites \ndes niveaux de Respect"]
["L'action n'est pas réalisée ou alors de manière très aléatoire.",null,"FAUX",0,0,0.14000000000000001,"Insuffisant","Il est nécessaire de formaliser les pratiques"]
["L'action est réalisée quelques fois de manière informelle.",null,"Plutôt Faux",0.3,0.15,0.49,"Informel","Il est nécessaire de pérenniser la bonne exécution des pratiques"]
["L'action est formalisée et réalisée de manière assez convaincante.",null,"Plutôt Vrai",0.7,0.5,0.74,"Acceptable","Il est nécessaire d'améliorer les pratiques"]
{"$rows_left_out":13}
{"sheet":"2- Article 3","index":1,"n_rows":8,"n_cols":6,"rows_kept":8,"cut":false,"hidden":false,"merged":[[6,0,6,1],[6,2,6,3],[0,0,0,5],[7,0,7,5],[1,1,1,5],[2,0,2,1],[2,2,2,5],[3,0,3,1],[3,2,3,4],[3,5,6,5],[4,0,4,1],[4,2,4,4],[5,0,5,1],[5,2,5,4]]}
[{"$f":"'1- Mode d''emploi'!A1","v":"Document d'autodiagnostic en référence à la norme ISO 31000:2009"}]
[null,"  Article 3: Les 11 principes du management du risque"]
["Etablissement :",null,{"$f":"'3- Article 4'!C3:F3","v":"-"}]
["Date de l'autodiagnostic (jj/mm/aaaa) : ",null,null,null,null,"Signature de l'évaluateur :\n\n\n\n\n"]
["Responsable de l'évaluation : "]
["L'équipe d'évaluation:"]
["Contact de la responsable : ",null,"Tél:",null,"@"]
["Pour établir un système de management de risque efficace au sein d'un organisme, il est indispensable de respecter les 11 principes ci-dessous, cités préalablement dans l'Article 3 de la norme ISO 31000:20009."]

{"sheet":"3- Article 4","index":2,"n_rows":88,"n_cols":15,"rows_kept":88,"cut":false,"hidden":false,"merged":[[84,4,84,5],[68,4,68,5],[69,4,69,5],[76,4,76,5],[78,4,78,5],[32,4,32,5],[38,4,38,5],[45,4,45,5],[53,4,53,5],[60,4,60,5],[1,1,1,5],[2,0,2,1],[2,2,2,5],[3,0,3,1],[3,2,3,4],[3,5,6,5],[4,0,4,1],[4,2,4,4],[5,0,5,1],[5,2,5,4],[6,0,6,1],[6,2,6,3],[9,4,9,5],[10,4,10,5],[20,4,20,5],[21,4,21,5],[24,4,24,5]]}
[{"$f":"'1- Mode d''emploi'!A1","v":"Document d'autodiagnostic en référence à la norme ISO 31000:2009"}]
[null,"  Autodiagnostic sur l'Article 4: Cadre Organisationnel"]
["Etablissement :",null,{"$f":"'1- Mode d''emploi'!$M$28","v":"-"},null,null,null,null,null,"Choix réalisé","% Véracité du choix","Pondération de chaque exigence","Taux de CONFORMITÉ pondéré sur l'exigence"]
["Date de l'autodiagnostic (jj/mm/aaaa) : ",null,null,null,null,"Signature de l'évaluateur :\n\n\n\n\n"]
["Responsable de l'évaluation : "]
["L'équipe d'évaluation:"]
["Contact de la responsable : ",null,"Tél:",null,"@"]
[]
["Réf.","Items des articles de la norme","Evaluations","Taux %","Libellés des évaluations","Modes de preuve et commentaires"]
["Art .4","Cadre Organisationnel",{"$f":"O10","v":"Insuffisant"},{"$f":"N10","v":0},{"$f":"IF('3- Article 4'!D10<='1- Mode d''emploi'!$F$18,'1- Mode d''emploi'!$H$18,IF(D10<='1- Mode d''emploi'!$F$19,'1- Mode d''emploi'!$H$19,IF(D10<'1- Mode d''emploi'!$E$21,'1- Mode d''emploi'!$H$20,'1- Mode d''emploi'!$H$21)))","v":"Il est nécessaire de formaliser les pratiques"},{"$f":"IF(E10<='1- Mode d''emploi'!$F$18,'1- Mode d''emploi'!$G$18,IF(E10<='1- Mode d''emploi'!$F$19,'1- Mode d''emploi'!$G$19,IF(E10<='1- Mode d''emploi'!$F$20,'1- Mode d''emploi'!$G$20,'1- Mode d''emploi'!$G$21)))","v":"Convaincant"},null,null,"Article",null,null,null,null,{"$f":"L11*K11+L21*K21+L69*K69+L79*K79+L85*K85","v":0},{"$f":"IF(N10<='1- Mode d''emploi'!$F$18,'1- Mode d''emploi'!$G$18,IF(N10<='1- Mode d''emploi'!$F$19,'1- Mode d''emploi'!$G$19,IF(N10<'1- Mode d''emploi'!$E$21,'1- Mode d''emploi'!$G$20,'1- Mode d''emploi'!$G$21)))","v":"Insuffisant"}]
["4.2","Mandat et engagement",{"$f":"M11","v":"Insuffisant"},{"$f":"L11","v":0},{"$f":"IF('3- Article 4'!D11<='1- Mode d''emploi'!$F$18,'1- Mode d''emploi'!$H$18,IF(D11<='1- Mode d''emploi'!$F$19,'1- Mode d''emploi'!$H$19,IF(D11<='1- Mode d''emploi'!$F$20,'1- Mode d''emploi'!$H$20,'1- Mode d''emploi'!$H$21)))","v":"Il est nécessaire de formaliser les pratiques"},{"$f":"IF(E11<='1- Mode d''emploi'!$F$18,'1- Mode d''emploi'!$G$18,IF(E11<='1- Mode d''emploi'!$F$19,'1- Mode d''emploi'!$G$19,IF(E11<='1- Mode d''emploi'!$F$20,'1- Mode d''emploi'!$G$20,'1- Mode d''emploi'!$G$21)))","v":"Convaincant"},null,null,"Sous-article",null,{"$f":"1/5","v":0.2},{"$f":"SUM(L12:L20)","v":0},{"$f":"IF(L11<='1- Mode d''emploi'!$F$18,'1- Mode d''emploi'!$G$18,IF(L11<='1- Mode d''emploi'!$F$19,'1- Mode d''emploi'!$G$19,IF(L11<='1- Mode d''emploi'!$F$20,'1- Mode d''emploi'!$G$20,'1- Mode d''emploi'!$G$21)))","v":"Insuffisant"}]
[1,"La direction définit et approuve la politique de management du risque","Choix",{"$f":"J12","v":0},{"$f":"VLOOKUP(C12,'1- Mode d''emploi'!$L$23:$N$27,3)","v":"Libellé du critère quand il sera choisi"},null,null,null,{"$f":"C12","v":"Choix"},{"$f":"VLOOKUP(I12,'1- Mode d''emploi'!$L$23:$M$27,2)","v":0},{"$f":"1/COUNTA($B$12:$B$20)","v":0.1111111111111111},{"$f":"IFERROR(K12*J12,\"\")","v":0}]
[2,"La direction s'assure que la culture de l'organisme et sa politique de management du risque sont en phase","Choix",{"$f":"J13","v":0},{"$f":"VLOOKUP(C13,'1- Mode d''emploi'!$L$23:$N$27,3)","v":"Libellé du critère quand il sera choisi"},null,null,null,{"$f":"C13","v":"Choix"},{"$f":"VLOOKUP(I13,'1- Mode d''emploi'!$L$23:$M$27,2)","v":0},{"$f":"1/COUNTA($B$12:$B$20)","v":0.1111111111111111},{"$f":"IFERROR(K13*J13,\"\")","v":0}]
[3,"La direction détermine des indicateurs de performance du management du risque cohérents avec les indicateurs de performance de l'organisme","Choix",0,{"$f":"VLOOKUP(C14,'1- Mode d''emploi'!$L$23:$N$27,3)","v":"Libellé du critère quand il sera choisi"},null,null,null,"Choix",{"$f":"VLOOKUP(I14,'1- Mode d''emploi'!$L$23:$M$27,2)","v":0},0.1111111111111111,{"$f":"IFERROR(K14*J14,\"\")","v":0}]
[4,"La direction aligne les objectifs du management du risque sur les objectifs et stratégies de l'organisme","Choix",0,{"$f":"VLOOKUP(C15,'1- Mode d''emploi'!$L$23:$N$27,3)","v":"Libellé du critère quand il sera choisi"},null,null,null,"Choix",{"$f":"VLOOKUP(I15,'1- Mode d''emploi'!$L$23:$M$27,2)","v":0},0.1111111111111111,0]
[5,"La direction s'assure de la conformité légale et réglementaire","Choix",0,{"$f":"VLOOKUP(C16,'1- Mode d''emploi'!$L$23:$N$27,3)","v":"Libellé du critère quand il sera choisi"},null,null,null,"Choix",{"$f":"VLOOKUP(I16,'1- Mode d''emploi'!$L$23:$M$27,2)","v":0},0.1111111111111111,0]
[6,"La direction affecte les responsabilités aux niveaux appropriés de l'organisme","Choix",0,{"$f":"VLOOKUP(C17,'1- Mode d''emploi'!$L$23:$N$27,3)","v":"Libellé du critère quand il sera choisi"},null,null,null,"Choix",{"$f":"VLOOKUP(I17,'1- Mode d''emploi'!$L$23:$M$27,2)","v":0},0.1111111111111111,0]
[7,"La direction s'assure que les ressources nécessaires sont allouées au management du risque","Choix",0,{"$f":"VLOOKUP(C18,'1- Mode d''emploi'!$L$23:$N$27,3)","v":"Libellé du critère quand il sera choisi"},null,null,null,"Choix",{"$f":"VLOOKUP(I18,'1- Mode d''emploi'!$L$23:$M$27,2)","v":0},0.1111111111111111,0]
[8,"La direction communique les avantages du management du risque à l'ensemble des parties prenantes","Choix",0,{"$f":"VLOOKUP(C19,'1- Mode d''emploi'!$L$23:$N$27,3)","v":"Libellé du critère quand il sera choisi"},null,null,null,"Choix",{"$f":"VLOOKUP(I19,'1- Mode d''emploi'!$L$23:$M$27,2)","v":0},0.1111111111111111,0]
[9,"La directions'assure que le cadre organisationnel de management du risque reste approprié","Choix",0,{"$f":"VLOOKUP(C20,'1- Mode d''emploi'!$L$23:$N$27,3)","v":"Libellé du critère quand il sera choisi"},null,null,null,"Choix",{"$f":"VLOOKUP(I20,'1- Mode d''emploi'!$L$23:$M$27,2)","v":0},0.1111111111111111,0]
{"$rows_left_out":69}
{"sheet":"4- Article 5","index":3,"n_rows":109,"n_cols":15,"rows_kept":109,"cut":false,"hidden":false,"merged":[[26,4,26,5],[30,4,30,5],[6,0,6,1],[6,2,6,3],[9,4,9,5],[10,4,10,5],[14,4,14,5],[18,4,18,5],[102,4,102,5],[62,4,62,5],[73,4,73,5],[82,4,82,5],[1,1,1,5],[2,0,2,1],[2,2,2,5],[3,0,3,1],[3,2,3,4],[3,5,6,5],[4,0,4,1],[4,2,4,4],[5,0,5,1],[5,2,5,4],[19,4,19,5],[23,4,23,5],[34,4,34,5],[44,4,44,5],[57,4,57,5],[61,4,61,5],[94,4,94,5],[35,4,35,5]]}
[{"$f":"'1- Mode d''emploi'!A1","v":"Document d'autodiagnostic en référence à la norme ISO 31000:2009"}]
[null,"  Autodiagnostic sur l'Article 5: Processus"]
["Etablissement :",null,{"$f":"'1- Mode d''emploi'!$M$28","v":"-"},null,null,null,null,null,"Choix réalisé","% Véracité du choix","Pondération de chaque exigence","Taux de CONFORMITÉ pondéré sur l'exigence"]
["Date de l'autodiagnostic (jj/mm/aaaa) : ",null,null,null,null,"Signature de l'évaluateur :\n\n\n\n\n"]
["Responsable de l'évaluation : "]
["L'équipe d'évaluation:"]
["Contact de la responsable : ",null,"Tél:",null,"@"]
[]
["Réf.","Items des articles de la norme","Evaluations","Taux %","Libellés des évaluations","Modes de preuve et commentaires"]
["Art .5","Processus",{"$f":"M10","v":"Insuffisant"},{"$f":"AVERAGE(D11,D15,D19,D35,D62,D95,D103)","v":0},{"$f":"IF('4- Article 5'!D10<='1- Mode d''emploi'!$F$18,'1- Mode d''emploi'!$H$18,IF(D10<='1- Mode d''emploi'!$F$19,'1- Mode d''emploi'!$H$19,IF(D10<='1- Mode d''emploi'!$F$20,'1- Mode d''emploi'!$H$20,'1- Mode d''emploi'!$H$21)))","v":"Il est nécessaire de formaliser les pratiques"},null,null,null,"Article",null,null,{"$f":"D10","v":0},{"$f":"IF(L10<='1- Mode d''emploi'!$F$18,'1- Mode d''emploi'!$G$18,IF(L10<='1- Mode d''emploi'!$F$19,'1- Mode d''emploi'!$G$19,IF(L10<='1- Mode d''emploi'!$F$20,'1- Mode d''emploi'!$G$20,'1- Mode d''emploi'!$G$21)))","v":"Insuffisant"},null,"-"]
["5.1","Généralités",{"$f":"M11","v":"Insuffisant"},{"$f":"L11","v":0},{"$f":"IF('4- Article 5'!D11<='1- Mode d''emploi'!$F$18,'1- Mode d''emploi'!$H$18,IF(D11<='1- Mode d''emploi'!$F$19,'1- Mode d''emploi'!$H$19,IF(D11<='1- Mode d''emploi'!$F$20,'1- Mode d''emploi'!$H$20,'1- Mode d''emploi'!$H$21)))","v":"Il est nécessaire de formaliser les pratiques"},null,null,null,"Sous-article n-1",null,null,{"$f":"SUM(L12:L14)","v":0},{"$f":"IF(L11<='1- Mode d''emploi'!$F$18,'1- Mode d''emploi'!$G$18,IF(L11<='1- Mode d''emploi'!$F$19,'1- Mode d''emploi'!$G$19,IF(L11<='1- Mode d''emploi'!$F$20,'1- Mode d''emploi'!$G$20,'1- Mode d''emploi'!$G$21)))","v":"Insuffisant"}]
[1,"Le management du risque est une partie intégrante du management.","Choix",{"$f":"J12","v":0},{"$f":"VLOOKUP(C12,'1- Mode d''emploi'!$L$23:$N$27,3)","v":"Libellé du critère quand il sera choisi"},null,null,null,{"$f":"C12","v":"Choix"},{"$f":"VLOOKUP(I12,'1- Mode d''emploi'!$L$23:$M$27,2)","v":0},{"$f":"1/3","v":0.33333333333333331},{"$f":"IFERROR(K12*J12,\"\")","v":0},{"$f":"AVERAGE(J12:J14)","v":0}]
[2,"Le management du risque est intégré à la culture et aux pratiques.","Choix",{"$f":"J13","v":0},{"$f":"VLOOKUP(C13,'1- Mode d''emploi'!$L$23:$N$27,3)","v":"Libellé du critère quand il sera choisi"},null,null,null,{"$f":"C13","v":"Choix"},{"$f":"VLOOKUP(I13,'1- Mode d''emploi'!$L$23:$M$27,2)","v":0},{"$f":"1/3","v":0.33333333333333331},{"$f":"IFERROR(K13*J13,\"\")","v":0}]
[3,"Le management du risque est adapté aux processus métiers de l'organisme.","Choix",0,{"$f":"VLOOKUP(C14,'1- Mode d''emploi'!$L$23:$N$27,3)","v":"Libellé du critère quand il sera choisi"},null,null,null,"Choix",{"$f":"VLOOKUP(I14,'1- Mode d''emploi'!$L$23:$M$27,2)","v":0},0.33333333333333331,{"$f":"IFERROR(K14*J14,\"\")","v":0}]
["5.2","Communication et concertation",{"$f":"M15","v":"Insuffisant"},{"$f":"L15","v":0},{"$f":"IF('4- Article 5'!D15<='1- Mode d''emploi'!$F$18,'1- Mode d''emploi'!$H$18,IF(D15<='1- Mode d''emploi'!$F$19,'1- Mode d''emploi'!$H$19,IF(D15<='1- Mode d''emploi'!$F$20,'1- Mode d''emploi'!$H$20,'1- Mode d''emploi'!$H$21)))","v":"Il est nécessaire de formaliser les pratiques"},null,null,null,"Sous-article n-1",null,null,{"$f":"SUM(L16:L18)","v":0},{"$f":"IF(L15<='1- Mode d''emploi'!$F$18,'1- Mode d''emploi'!$G$18,IF(L15<='1- Mode d''emploi'!$F$19,'1- Mode d''emploi'!$G$19,IF(L15<='1- Mode d''emploi'!$F$20,'1- Mode d''emploi'!$G$20,'1- Mode d''emploi'!$G$21)))","v":"Insuffisant"}]
[1,"Une communication et une concertation existent entre les parties internes et externes à toutes les étapes du processus du management du risque.","Choix",{"$f":"J16","v":0},{"$f":"VLOOKUP(C16,'1- Mode d''emploi'!$L$23:$N$27,3)","v":"Libellé du critère quand il sera choisi"},null,null,null,{"$f":"C16","v":"Choix"},{"$f":"VLOOKUP(I16,'1- Mode d''emploi'!$L$23:$M$27,2)","v":0},{"$f":"1/3","v":0.33333333333333331},0]
[2,"Des plans de communication et de concertation appropriés sont élaborés.","Choix",{"$f":"J17","v":0},{"$f":"VLOOKUP(C17,'1- Mode d''emploi'!$L$23:$N$27,3)","v":"Libellé du critère quand il sera choisi"},null,null,null,{"$f":"C17","v":"Choix"},{"$f":"VLOOKUP(I17,'1- Mode d''emploi'!$L$23:$M$27,2)","v":0},{"$f":"1/3","v":0.33333333333333331},0]
[3,"Vos plans de communications traitent les risques, les causes et les alternatives.","Choix",0,{"$f":"VLOOKUP(C18,'1- Mode d''emploi'!$L$23:$N$27,3)","v":"Libellé du critère quand il sera choisi"},null,null,null,"Choix",{"$f":"VLOOKUP(I18,'1- Mode d''emploi'!$L$23:$M$27,2)","v":0},0.33333333333333331,0]
["5.3","Etablissement du contexte",{"$f":"M19","v":"Insuffisant"},{"$f":"L19","v":0},{"$f":"IF('4- Article 5'!D19<='1- Mode d''emploi'!$F$18,'1- Mode d''emploi'!$H$18,IF(D19<='1- Mode d''emploi'!$F$19,'1- Mode d''emploi'!$H$19,IF(D19<='1- Mode d''emploi'!$F$20,'1- Mode d''emploi'!$H$20,'1- Mode d''emploi'!$H$21)))","v":"Il est nécessaire de formaliser les pratiques"},null,null,null,"Sous-article n-1",null,null,{"$f":"L20*K20+L24*K24+L27*K27+L31*K31","v":0},{"$f":"IF(L19<='1- Mode d''emploi'!$F$18,'1- Mode d''emploi'!$G$18,IF(L19<='1- Mode d''emploi'!$F$19,'1- Mode d''emploi'!$G$19,IF(L19<='1- Mode d''emploi'!$F$20,'1- Mode d''emploi'!$G$20,'1- Mode d''emploi'!$G$21)))","v":"Insuffisant"}]
["5.3.2","Etablissement du contexte externe",{"$f":"M20","v":"Insuffisant"},{"$f":"L20","v":0},{"$f":"IF('4- Article 5'!D20<='1- Mode d''emploi'!$F$18,'1- Mode d''emploi'!$H$18,IF(D20<='1- Mode d''emploi'!$F$19,'1- Mode d''emploi'!$H$19,IF(D20<='1- Mode d''emploi'!$F$20,'1- Mode d''emploi'!$H$20,'1- Mode d''emploi'!$H$21)))","v":"Il est nécessaire de formaliser les pratiques"},null,null,null,"Sous-article n-2",null,{"$f":"1/4","v":0.25},{"$f":"SUM(L21:L23)","v":0},{"$f":"IF(L20<='1- Mode d''emploi'!$F$18,'1- Mode d''emploi'!$G$18,IF(L20<='1- Mode d''emploi'!$F$19,'1- Mode d''emploi'!$G$19,IF(L20<='1- Mode d''emploi'!$F$20,'1- Mode d''emploi'!$G$20,'1- Mode d''emploi'!$G$21)))","v":"Insuffisant"}]
{"$rows_left_out":90}
{"sheet":"5- Résultats Article 4","index":4,"n_rows":33,"n_cols":8,"rows_kept":33,"cut":false,"hidden":false,"merged":[[32,2,32,4],[12,0,12,4],[12,5,12,7],[13,5,13,7],[14,5,14,7],[27,1,27,4],[28,2,28,4],[29,2,29,4],[30,2,30,4],[31,2,31,4],[27,0,32,0],[25,0,25,7],[7,6,7,7],[8,4,8,5],[19,6,19,7],[21,6,21,7],[22,6,22,7],[8,2,8,3],[23,6,23,7],[1,3,2,5],[17,6,17,7],[18,6,18,7],[11,0,11,7],[5,0,5,1],[5,2,5,3],[5,4,5,5],[5,6,5,7],[6,0,6,1],[6,2,6,3],[6,4,6,5],[6,6,6,7],[7,2,7,3],[7,4,7,5]]}
[{"$f":"'1- Mode d''emploi'!A1","v":"Document d'autodiagnostic en référence à la norme ISO 31000:2009"}]
[null,null,null,"Résultats de l'Article 4 de l'ISO 31000:2009"]
[]
[]
[null,null,"Informations sur le Service management de la qualité",null,null,null,"Informations sur l'Autodiagnostic"]
["Responsable du SMQ :",null,{"$f":"'1- Mode d''emploi'!$M$28","v":"-"},null,"Date de l'autodiagnostic : (dd/jj/aaaa)"]
["Contact du responsable du SMQ :",null,{"$f":"'1- Mode d''emploi'!$M$29","v":"-"},null,"Responsable de l'évaluation :"]
[null,null,"Tel:",null,"L'équipe d'évaluation :"]
[null,null,null,null,"Contact du responsable : ",null,"Tel :","@ :"]
[]
[]
["BILAN, COMMENTAIRES,PLANS D'ACTION d'amélioration et REX "]
["Taux de Respect des exigences de l'Article 4 de la norme :",null,null,null,null,"COMMENTAIRES sur les RÉSULTATS obtenus"]
[null,{"$f":"G28","v":0},{"$f":"F28","v":"Insuffisant"},null,null,"Commentaires (collectifs si possible)  :"]
[null,null,null,null,null,"DÉCISIONS : Plans d'action PRIORITAIRES"]
[null,null,null,null,null,"QUOI\nObjectifs à atteindre","QUI\nen Interne ou en Externe","QUAND\nDates début et fin"]
[null,null,null,null,null,"Plan n°1 :"]
[null,null,null,null,null,"Efficacité"]
[null,null,null,null,null,"Efficience"]
[null,null,null,null,null,"Qualité pércue"]
{"$rows_left_out":14}
{"sheet":"6- Résultats Article 5","index":5,"n_rows":35,"n_cols":8,"rows_kept":35,"cut":false,"hidden":false,"merged":[[11,0,11,7],[5,0,5,1],[5,2,5,3],[5,4,5,5],[5,6,5,7],[6,0,6,1],[6,2,6,3],[6,4,6,5],[6,6,6,7],[7,2,7,3],[7,4,7,5],[7,6,7,7],[8,2,8,3],[8,4,8,5],[12,0,12,4],[12,5,12,7],[13,5,13,7],[14,5,14,7],[21,6,21,7],[22,6,22,7],[23,6,23,7],[17,6,17,7],[18,6,18,7],[19,6,19,7],[32,2,32,4],[25,0,25,7],[27,0,34,0],[27,1,27,4],[28,2,28,4],[29,2,29,4],[30,2,30,4],[33,2,33,4],[34,2,34,4],[31,2,31,4]]}
[{"$f":"'1- Mode d''emploi'!A1","v":"Document d'autodiagnostic en référence à la norme ISO 31000:2009"}]
[null,null,null,null,"Résultats de l'Article 5 de l'ISO 31000:2009"]
[]
[]
[null,null,"Informations sur le Service management de la qualité",null,null,null,"Informations sur l'Autodiagnostic"]
["Responsable du SMQ :",null,{"$f":"'1- Mode d''emploi'!$M$28","v":"-"},null,"Date de l'autodiagnostic : (dd/jj/aaaa)"]
["Contact du responsable du SMQ :",null,{"$f":"'1- Mode d''emploi'!$M$29","v":"-"},null,"Responsable de l'évaluation :"]
[null,null,"Tel:",null,"L'équipe d'évaluation :"]
[null,null,null,null,"Contact du responsable : ",null,"Tel :","@ :"]
[]
[]
["BILAN, COMMENTAIRES,PLANS D'ACTION d'amélioration et REX "]
["Taux de Respect aux exigences de l'Article 5 de la norme :",null,null,null,null,"COMMENTAIRES sur les RÉSULTATS obtenus"]
[null,{"$f":"G28","v":0},{"$f":"F28","v":"Insuffisant"},null,null,"Commentaires (collectifs si possible)  :"]
[null,null,null,null,null,"DÉCISIONS : Plans d'action PRIORITAIRES"]
[null,null,null,null,null,"QUOI\nObjectifs à atteindre","QUI\nen Interne ou en Externe","QUAND\nDates début et fin"]
[null,null,null,null,null,"Plan n°1 :"]
[null,null,null,null,null,"Efficacité"]
[null,null,null,null,null,"Efficience"]
[null,null,null,null,null,"Qualité pércue"]
{"$rows_left_out":16}
{"sheet":"7- Résultat Global","index":6,"n_rows":54,"n_cols":15,"rows_kept":54,"cut":false,"hidden":false,"merged":[[8,4,8,5],[24,0,24,4],[24,5,24,7],[11,0,11,3],[10,0,10,7],[5,0,5,1],[5,2,5,3],[5,4,5,5],[5,6,5,7],[6,0,6,1],[6,2,6,3],[6,4,6,5],[6,6,6,7],[7,2,7,3],[7,4,7,5],[7,6,7,7],[8,2,8,3],[25,5,25,7],[26,5,26,7],[37,0,37,7],[44,2,44,4],[39,0,44,0],[42,2,42,4],[43,2,43,4],[39,1,39,4],[35,6,35,7],[34,0,35,4],[29,6,29,7],[30,6,30,7],[31,6,31,7],[33,6,33,7],[34,6,34,7],[4,0,4,3],[45,0,52,0],[45,1,45,4],[48,2,48,4],[49,2,49,4],[40,2,40,4],[41,2,41,4],[52,2,52,4],[46,2,46,4],[50,2,50,4],[51,2,51,4],[47,2,47,4],[13,0,13,3],[11,4,11,7],[18,0,18,3],[23,0,23,7]]}
[null,null,null,null,null,null,null,"Impression sur pages A4 100% en format horizontal"]
[null,null,null,null,"   Autodiagnostic  de la norme ISO 31000:2009"]
[]
[]
["Informations sur le Service management de la qualité",null,null,null,null,null,"Informations sur l'Autodiagnostic"]
["Responsable du SMQ :",null,{"$f":"'1- Mode d''emploi'!$M$28","v":"-"},null,"Date de l'autodiagnostic : (dd/jj/aaaa)"]
["Contact du responsable du SMQ :",null,{"$f":"'1- Mode d''emploi'!$M$29","v":"-"},null,"Responsable de l'évaluation :"]
[null,null,"Tel:",null,"L'équipe d'évaluation :"]
[null,null,"@:",null,"Contact du responsable : ",null,"Tel :","@ :"]
[]
["TABLEAUX DE BORD sur le niveau de Respect et de réalisation selon la norme ISO 31000:2009"]
[null,null,null,null,"Niveau de Respect des ARTICLES de la norme"]
[]
["Niveaux de Respect des 12 SOUS-ARTICLES de la norme",null,null,null,null,null,null,null,null,null,null,{"$f":"SUM(L15:L18)","v":12}]
[null,null,null,null,null,null,null,null,null,null,"Insuffisant",{"$f":"COUNTIFS($F$41:$F$45,K15)+COUNTIFS($F$47:$F$53,K15)","v":12},null,{"$f":"'1- Mode d''emploi'!L24","v":"FAUX"},{"$f":"COUNTIFS('3- Article 4'!$I$12:$I$88,N15)+COUNTIFS('4- Article 5'!$I$12:$I$109,N15)","v":0}]
[null,null,null,null,null,null,null,null,null,null,"Informel",{"$f":"COUNTIFS($F$41:$F$45,K16)+COUNTIFS($F$47:$F$53,K16)","v":0},null,{"$f":"'1- Mode d''emploi'!L25","v":"Plutôt Faux"},{"$f":"COUNTIFS('3- Article 4'!$I$12:$I$88,N16)+COUNTIFS('4- Article 5'!$I$12:$I$109,N16)","v":0}]
[null,null,null,null,null,null,null,null,null,null,"Convaincant",0,null,{"$f":"'1- Mode d''emploi'!L26","v":"Plutôt Vrai"},{"$f":"COUNTIFS('3- Article 4'!$I$12:$I$88,N17)+COUNTIFS('4- Article 5'!$I$12:$I$109,N17)","v":0}]
[null,null,null,null,null,null,null,null,null,null,"Convaincant",0,null,true,{"$f":"COUNTIFS('3- Article 4'!$I$12:$I$88,N18)+COUNTIFS('4- Article 5'!$I$12:$I$109,N18)","v":0}]
[]
[]
{"$rows_left_out":34}