{"text_format":"1","workbook":"xlsx","n_sheets":7,"sheets":["Mode d'Emploi","Evaluation","Résultats globaux","Feuil1","Résultats par document","Conseils","Correspondance avec l'ISO 9001"],"not_rendered":{"charts":33,"images":4,"macros":1,"external_links":0,"defined_names":13,"comments":1,"pivot_tables":0},"unopened":[],"bounds":{"document_bytes":16777216,"sheet_cells":100000,"rows_first":2000,"rows_last":500,"rows_between":2000,"halvings":0,"cell_chars":16384,"cell_head_chars":4096},"cells_cut":0,"cells_raw":0,"read":"whole","date_system":"1900"}

{"sheet":"Mode d'Emploi","index":0,"n_rows":21,"n_cols":14,"rows_kept":21,"cut":false,"hidden":false,"merged":[[20,1,20,9],[16,1,16,2],[15,8,15,9],[16,8,16,9],[1,3,1,9],[5,1,5,3],[6,1,6,3],[6,4,6,7],[2,3,2,9],[3,1,3,9],[8,1,8,9],[9,1,12,9],[14,5,14,9],[5,4,5,9],[6,8,6,9],[14,1,14,4],[19,8,19,9],[18,8,18,9],[17,8,17,9],[13,1,13,9],[4,1,4,3],[4,4,4,9],[15,1,15,2],[19,1,19,2],[18,1,18,2],[17,1,17,2]]}
[null,null,null,null,null,null,null,null,null,"Enregistrement qualité :  A4 100% vertical"]
[null,null,null,"  Autodiagnostic \"Performance du système documentaire\""]
[null,null,null,"Applicable avec la norme ISO 9001 \"Systèmes de management de la qualité - Exigences\", versions 2008 et 2015"]
[null,"Attention : Seules les cases écrites en bleu peuvent être modifiées par l’utilisateur. Cela concerne toutes les parties de l’outil"]
[null,"Etablissement :",null,null,"Nom de l'organisation"]
[null," Responsable du SMQ : ",null,null,"Nom du responsable du SMQ"]
[null," Contact du Responsable du SMQ :",null,null,"@",null,null,null,"Tél:"]
[]
[null,"Mode d'emploi"]
[null,"\nOBJECTIF:   \nCet outil permet aux différents utilisateurs, et en particulier aux responsables qualité, d'évaluer la performance des documents utilisés dans le cadre des différents processus et activités d'un organisme. Il donne une vue d'ensemble de la performance documentaire (jusqu'à 30 documents analysés simultanément), selon 3 grands critères : \"Utile, Utilisable, Utilisé\". Le tableau de bord ainsi constitué permet de définir facilement des actions afin d'améliorer la performance documentaire de l'organisme.\n(NB : Cet outil ne garantit pas le respect des exigences documentaires de l'ISO 9001)\n\nPRESENTATION DES ELEMENTS:  \n    - Mode d'emploi :\n         * Explicite le fonctionnement de l'outil et les critères d'évaluation définis\n    - Evaluation : \n         * Jusqu'à 30 documents sont évalués selon des critères définis grâce à la règle des 3U \"Utile, Utilisable, Utilisé\"\n         * Les résultats s'affichent UNIQUEMENT lorsque tous les champs relatifs au(x) document(s) sont remplis\n    - Résultats globaux :\n         * Tous les résultats sont réunis sur cet onglet avec une cartographie globale des documents renseignés\n         * Le graphique radar peut être ajusté selon le nombre de documents renseignés avec la commande \"Actualiser\"\n    - Résultats par document : \n         * Le niveau de PERFORMANCE détaillé de chaque document est présenté sous forme radar\n         * Les plans d'actions à mettre en œuvre et à déployer peuvent être renseignés (Quoi, Qui, Quand...)                                                                                                -   - Conseils : \n         * Quelques conseils pour améliorer la performance documentaire\n    - Correspondance avec l'ISO 9001 : \n         * La correspondance entre chacun des critères de l'outil avec les chapitres de la norme ISO 9001, versions 2008 et 2015"]
[]
[null,null,null,null,null,null,null,null,null,null,null,null,"Utilitaires pour l'Autodiagnostic"]
[null,null,null,null,null,null,null,null,null,null,null,null,"Paramétrage des affectations selon le N° du choix"]
[null,"Échelles d'évaluation utilisées",null,null,null,null,null,null,null,null,null,null,"Utilisé pour  {Exigences} : affectation d'un N° selon le choix réalisé"]
[null,"Niveaux de VÉRACITÉ quant à la RÉALISATION \ndes actions associées à la règle des 3 U",null,null,null,"LIBELLÉS des niveaux de PERFORMANCE \ndes DOCUMENTS renseignés dans l'outil ",null,null,null,null,null,null,"Choix proposé","A faire en manuel\nN° du choix croissant selon son  Ordre Alphabétique : 1 à …"]
{"$rows_left_out":7}
{"sheet":"Evaluation","index":1,"n_rows":520,"n_cols":23,"rows_kept":520,"cut":false,"hidden":false,"merged":[[499,4,499,5],[503,4,503,5],[504,4,504,5],[508,4,508,5],[516,4,516,5],[474,4,474,5],[482,4,482,5],[486,4,486,5],[487,4,487,5],[491,4,491,5],[453,4,453,5],[457,4,457,5],[465,4,465,5],[469,4,469,5],[470,4,470,5],[435,4,435,5],[436,4,436,5],[440,4,440,5],[448,4,448,5],[452,4,452,5],[414,4,414,5],[418,4,418,5],[419,4,419,5],[423,4,423,5],[431,4,431,5],[389,4,389,5],[397,4,397,5],[401,4,401,5],[402,4,402,5],[406,4,406,5],[368,4,368,5],[372,4,372,5],[380,4,380,5],[384,4,384,5],[385,4,385,5],[350,4,350,5],[351,4,351,5],[355,4,355,5],[363,4,363,5],[367,4,367,5],[248,4,248,5],[282,4,282,5],[283,4,283,5],[334,4,334,5],[338,4,338,5],[346,4,346,5],[312,4,312,5],[316,4,316,5],[317,4,317,5],[321,4,321,5],[329,4,329,5],[333,4,333,5],[304,4,304,5],[249,4,249,5],[253,4,253,5],[261,4,261,5],[265,4,265,5],[266,4,266,5],[270,4,270,5],[278,4,278,5],[287,4,287,5],[295,4,295,5],[299,4,299,5],[300,4,300,5],[134,4,134,5],[142,4,142,5],[146,4,146,5],[129,4,129,5],[236,4,236,5],[151,4,151,5],[164,4,164,5],[168,4,168,5],[176,4,176,5],[180,4,180,5],[181,4,181,5],[210,4,210,5],[227,4,227,5],[214,4,214,5],[215,4,215,5],[219,4,219,5],[231,4,231,5],[232,4,232,5],[185,4,185,5],[100,4,100,5],[108,4,108,5],[112,4,112,5],[125,4,125,5],[130,4,130,5],[1,0,1,5],[5,2,5,3],[6,2,7,4],[23,4,23,5],[2,2,2,5],[3,2,3,4],[3,5,7,5],[40,4,40,5],[11,4,11,5],[15,4,15,5],[4,2,4,4],[10,4,10,5],[27,4,27,5],[28,4,28,5],[117,4,117,5],[44,4,44,5],[45,4,45,5],[49,4,49,5],[61,4,61,5],[2,0,2,1],[3,0,3,1],[4,0,5,1],[6,0,7,1],[197,4,197,5],[198,4,198,5],[202,4,202,5],[244,4,244,5],[32,4,32,5],[147,4,147,5],[159,4,159,5],[163,4,163,5],[193,4,193,5],[66,4,66,5],[91,4,91,5],[78,4,78,5],[79,4,79,5],[74,4,74,5],[113,4,113,5],[83,4,83,5],[57,4,57,5],[62,4,62,5],[95,4,95,5],[96,4,96,5]]}
[null,null,null,null,null,"Impression sur pages A4 100% en format vertical"]
[{"$f":"'Mode d''Emploi'!D2","v":"  Autodiagnostic \"Performance du système documentaire\""},null,null,null,null,null,null,null,null,null,null,null,null,null,null,null,"Somme des pondérations des Articles","Taux moyen de conformité sur la Norme","Niveau de RESPECT pour la norme"]
[{"$f":"'Mode d''Emploi'!B5","v":"Etablissement :"},null,{"$f":"'Mode d''Emploi'!E5","v":"Nom de l'organisation"},null,null,null,null,null,null,null,"Somme des pondérations sur les exigences","Taux  moyen de CONFORMITÉ pour le sous-article","Niveau de RESPECT pour le sous-article","Automatique : pondération de chaque sous- chapitre","Taux  moyen de CONFORMITÉ pondéré pour le sous-article"]
["Date de l'autodiagnostic : ",null,null,null,null,"Signature du responsable de l'autodiagnostic :\n\n\n\n\n"]
["Responsable de l'autodiagnostic : ",null,"Indiquez le nom du responsable de l'autodiagnostic",null,null,null,null,"Choix réalisé","N° du choix réalisé","% Véracité du choix","Automatique : pondération de chaque exigence","Taux de CONFORMITÉ pondéré sur l'exigence",null,null,null,"Resultats, Actions et REX "]
[null,null,"Tél :",null,"@"]
["L'équipe d'autodiagnostic :",null,"Indiquez les noms des contributeurs à l'autodiagnostic"]
[]
[]
["Réf.","Critères de performance selon la règle des 3U","Evaluations","Taux %","Libellés \ndes évaluations","Modes de preuve \net commentaires",null,null,null,null,null,null,null,null,null,null,null,null,null,null,null,"Choix proposé","A faire en manuel\nN° du choix croissant selon son  Ordre Alphabétique : 1 à …"]
["1.","Indiquez ici le titre du document",{"$f":"IF(COUNTIF(I13:I27,1),\" \",P11)","v":" "},{"$f":"IF(COUNTIF($I13:$I27,1),\" \",$O11)","v":" "},{"$f":"IF(COUNTIF(I13:I27,1),\" \",IFERROR(IF($O11<='Mode d''Emploi'!$G$17,'Mode d''Emploi'!$I$17,IF($O11<='Mode d''Emploi'!$G$18,'Mode d''Emploi'!$I$18,IF($O11<='Mode d''Emploi'!$G$19,'Mode d''Emploi'!$I$19,'Mode d''Emploi'!$I$20))),\"\"))","v":" "},null,null,{"$f":"B11","v":"Indiquez ici le titre du document"},null,null,null,null,"vérifier si Somme = 1 =>  ",{"$f":"SUM(N12:N25)","v":1},{"$f":"IFERROR(SUM(O12:O25),\"\")","v":0},{"$f":"IFERROR(IF(O11<='Mode d''Emploi'!$G$17,'Mode d''Emploi'!$H$17,IF(O11<='Mode d''Emploi'!$G$18,'Mode d''Emploi'!$H$18,IF(O11<='Mode d''Emploi'!$G$19,'Mode d''Emploi'!$H$19,'Mode d''Emploi'!$H$20))),\"\")","v":"Insuffisant"},{"$f":"1/7","v":0.14285714285714285},{"$f":"O11*Q11","v":0},null,null,null,"Choix de \nVÉRACITÉ",1]
["Cr 1.","\"Utile\"",{"$f":"IF(COUNTIF(I13:I15,1),\" \",M12)","v":" "},{"$f":"IF(COUNTIF($I13:$I15,1),\" \",$L12)","v":" "},{"$f":"IF(COUNTIF(I13:I15,1),\" \",IFERROR(IF($L12<='Mode d''Emploi'!$G$17,'Mode d''Emploi'!$I$17,IF($L12<='Mode d''Emploi'!$G$18,'Mode d''Emploi'!$I$18,IF($L12<='Mode d''Emploi'!$G$19,'Mode d''Emploi'!$I$19,'Mode d''Emploi'!$I$20))),\"\"))","v":" "},null,null,"Utile",null,"vérifier si Somme = 1 =>  ",{"$f":"SUM(K13:K15)","v":1},{"$f":"IFERROR(SUM(L13:L15),\"\")","v":0},{"$f":"IFERROR(IF(L12<='Mode d''Emploi'!$G$17,'Mode d''Emploi'!$H$17,IF(L12<='Mode d''Emploi'!$G$18,'Mode d''Emploi'!$H$18,IF(L12<='Mode d''Emploi'!$G$19,'Mode d''Emploi'!$H$19,'Mode d''Emploi'!$H$20))),\"\")","v":"Insuffisant"},{"$f":"1/COUNTA($M$12:$M$25)","v":0.33333333333333331},{"$f":"N12*L12","v":0},null,null,null,null,null,null,"Faux",2]
["1.1","Le document contribue à la réalisation d'une activité/à l'obtention de résultats.","Choix de \nVÉRACITÉ",{"$f":"J13","v":""},{"$f":"CHOOSE(I13,\"Libellé du critère quand il sera choisi\",'Mode d''Emploi'!$B$17,'Mode d''Emploi'!$B$18,'Mode d''Emploi'!$B$19,'Mode d''Emploi'!$B$20,,)","v":"Libellé du critère quand il sera choisi"},null,null,{"$f":"C13","v":"Choix de \nVÉRACITÉ"},{"$f":"IFERROR((VLOOKUP(C13,'Mode d''Emploi'!$M$16:$N$20,2)),\"\")","v":1},{"$f":"IFERROR(CHOOSE(I13,\"\",'Mode d''Emploi'!$E$17,'Mode d''Emploi'!$E$18,'Mode d''Emploi'!$E$19,'Mode d''Emploi'!$E$20,),\"\")","v":""},{"$f":"1/COUNTA($B$13:$B$15)","v":0.33333333333333331},{"$f":"IFERROR(J13*K13,\"\")","v":""},null,null,null,null,null,null,null,null,null,"Plutôt Faux",3]
["1.2","Le document est à jour, les données qu'il contient ne comportent pas d'erreurs.","Choix de \nVÉRACITÉ",{"$f":"J14","v":""},{"$f":"CHOOSE(I14,\"Libellé du critère quand il sera choisi\",'Mode d''Emploi'!$B$17,'Mode d''Emploi'!$B$18,'Mode d''Emploi'!$B$19,'Mode d''Emploi'!$B$20,,)","v":"Libellé du critère quand il sera choisi"},null,null,{"$f":"C14","v":"Choix de \nVÉRACITÉ"},{"$f":"IFERROR((VLOOKUP(C14,'Mode d''Emploi'!$M$16:$N$20,2)),\"\")","v":1},{"$f":"IFERROR(CHOOSE(I14,\"\",'Mode d''Emploi'!$E$17,'Mode d''Emploi'!$E$18,'Mode d''Emploi'!$E$19,'Mode d''Emploi'!$E$20,),\"\")","v":""},{"$f":"1/COUNTA($B$13:$B$15)","v":0.33333333333333331},{"$f":"IFERROR(J14*K14,\"\")","v":""},null,null,null,null,null,null,null,null,null,"Plutôt Vrai",4]
["1.3","Le document est en adéquation avec les informations recherchées par l'utilisateur.","Choix de \nVÉRACITÉ",{"$f":"J15","v":""},{"$f":"CHOOSE(I15,\"Libellé du critère quand il sera choisi\",'Mode d''Emploi'!$B$17,'Mode d''Emploi'!$B$18,'Mode d''Emploi'!$B$19,'Mode d''Emploi'!$B$20,,)","v":"Libellé du critère quand il sera choisi"},null,null,{"$f":"C15","v":"Choix de \nVÉRACITÉ"},{"$f":"IFERROR((VLOOKUP(C15,'Mode d''Emploi'!$M$16:$N$20,2)),\"\")","v":1},{"$f":"IFERROR(CHOOSE(I15,\"\",'Mode d''Emploi'!$E$17,'Mode d''Emploi'!$E$18,'Mode d''Emploi'!$E$19,'Mode d''Emploi'!$E$20,),\"\")","v":""},{"$f":"1/COUNTA($B$13:$B$15)","v":0.33333333333333331},{"$f":"IFERROR(J15*K15,\"\")","v":""},null,null,null,null,null,null,null,null,null,"Vrai",5]
{"$rows_left_out":506}
{"sheet":"Résultats globaux","index":2,"n_rows":226,"n_cols":18,"rows_kept":226,"cut":false,"hidden":false,"merged":[[24,0,24,4],[5,6,6,7],[4,0,4,1],[4,2,4,3],[8,0,8,7],[9,0,9,3],[30,0,30,7],[28,1,28,4],[26,1,26,4],[27,1,27,4],[3,0,3,3],[5,0,5,1],[6,0,6,1],[5,2,5,3],[15,0,15,3],[9,4,9,7],[25,1,25,4],[22,0,22,7],[23,0,23,7],[14,0,14,3],[21,0,21,7],[24,5,24,7]]}
[null,null,null,null,null,null,null,"Impression sur pages A4 100% en format horizontal"]
[null,null,null,null,{"$f":"'Mode d''Emploi'!D2","v":"  Autodiagnostic \"Performance du système documentaire\""}]
[]
["Informations sur le Service Management de la Qualité",null,null,null,null,null,"Informations sur l'Autodiagnostic"]
[{"$f":"'Mode d''Emploi'!B5","v":"Etablissement :"},null,{"$f":"'Mode d''Emploi'!E5","v":"Nom de l'organisation"},null,{"$f":"Evaluation!A4","v":"Date de l'autodiagnostic : "},{"$f":"IF(Evaluation!C4=\"\",\"\",Evaluation!C4)","v":""},{"$f":"Evaluation!A7","v":"L'équipe d'autodiagnostic :"}]
[{"$f":"'Mode d''Emploi'!B6","v":" Responsable du SMQ : "},null,{"$f":"'Mode d''Emploi'!E6","v":"Nom du responsable du SMQ"},null,"Responsable : ",{"$f":"IF(Evaluation!C5=\"\",\"\",Evaluation!C5)","v":"Indiquez le nom du responsable de l'autodiagnostic"},{"$f":"Evaluation!C7","v":"Indiquez les noms des contributeurs à l'autodiagnostic"}]
[null,null,{"$f":"'Mode d''Emploi'!E7","v":"@"},{"$f":"'Mode d''Emploi'!I7","v":"Tél:"},{"$f":"IF(Evaluation!C6=\"\",\"\",Evaluation!C6)","v":"Tél :"},{"$f":"IF(Evaluation!E6=\"\",\"\",Evaluation!E6)","v":"@"}]
[]
["TABLEAUX DE BORD sur les niveaux de CONFORMITÉ et de RÉALISATION selon les exigences de la norme ISO 9001:2015",null,null,null,null,null,null,null,null,null,null,null,"Utilitaires pour les CALCULS et les GRAPHIQUES"]
["Niveaux de VÉRACITÉ quant à la PERFORMANCE des DOCUMENTS",null,null,null,"Niveaux de PERFORMANCE de vos DOCUMENTS par rapport à la règle des 3U"]
[null,null,null,null,null,"Moyenne générale :",{"$f":"G33","v":{"$error":"#DIV/0!"}},{"$f":"E33","v":""},null,null,"Histogramme des niveaux de PERFORMANCE",null,null,null,null,"Histogramme des niveaux de VÉRACITÉ"]
[null,null,null,null,null,null,null,null,null,null,"PERFORMANCE","Nb d'Articles","Tracer la moyenne",null,"VÉRACITÉ",null,"Nb de critères d'exigences","Ecart vs 120"]
[null,null,null,null,null,null,null,null,null,null,"Niveaux",{"$f":"SUM(L14:L17)","v":0},": Total ou 0",null,"Niveaux","N°",{"$f":"SUM(Q14:Q17)","v":0},{"$f":"260-Q13","v":260}]
[null,null,null,null,null,null,null,null,null,null,{"$f":"'Mode d''Emploi'!H17","v":"Insuffisant"},{"$f":"IFERROR(COUNTIFS($F$35:$F$153,K14),0)","v":0},{"$f":"IF($E$33=K14,30,0)","v":0},null,"Faux",{"$f":"'Mode d''Emploi'!N17","v":2},{"$f":"IFERROR(COUNTIFS(Evaluation!$I$13:$I$520,$P14),0)","v":0}]
["Niveaux de PERFORMANCE des DOCUMENTS par critère",null,null,null,null,null,null,null,null,null,{"$f":"'Mode d''Emploi'!H18","v":"Moyen"},{"$f":"IFERROR(COUNTIFS($F$35:$F$153,K15),0)","v":0},{"$f":"IF($E$33=K15,30,0)","v":0},null,"Plutôt Faux",{"$f":"'Mode d''Emploi'!N18","v":3},{"$f":"IFERROR(COUNTIFS(Evaluation!$I$13:$I$520,$P15),0)","v":0}]
{"$rows_left_out":212}
{"sheet":"Feuil1","index":3,"n_rows":65,"n_cols":5,"rows_kept":65,"cut":false,"hidden":true,"merged":[]}
[]
[]
[]
[]
[]
[]
[]
[]
[]
[]
[]
[]
[]
[]
[]
{"$rows_left_out":51}
{"sheet":"Résultats par document","index":4,"n_rows":277,"n_cols":8,"rows_kept":277,"cut":false,"hidden":false,"merged":[[262,5,262,7],[263,5,263,7],[270,5,270,7],[271,5,271,7],[272,5,272,7],[245,5,245,7],[252,5,252,7],[253,5,253,7],[254,5,254,7],[261,5,261,7],[234,5,234,7],[235,5,235,7],[236,5,236,7],[243,5,243,7],[244,5,244,7],[217,5,217,7],[218,5,218,7],[225,5,225,7],[226,5,226,7],[227,5,227,7],[200,5,200,7],[207,5,207,7],[208,5,208,7],[209,5,209,7],[216,5,216,7],[189,5,189,7],[190,5,190,7],[191,5,191,7],[198,5,198,7],[199,5,199,7],[10,5,10,7],[55,5,55,7],[56,5,56,7],[45,5,45,7],[54,5,54,7],[11,5,11,7],[46,5,46,7],[47,5,47,7],[19,5,19,7],[20,5,20,7],[27,5,27,7],[28,5,28,7],[29,5,29,7],[64,5,64,7],[36,5,36,7],[37,5,37,7],[38,5,38,7],[18,5,18,7],[63,5,63,7],[3,0,3,3],[4,0,4,1],[4,2,4,3],[5,6,6,7],[9,5,9,7],[5,0,5,1],[5,2,5,3],[6,0,6,1],[65,5,65,7],[72,5,72,7],[73,5,73,7],[74,5,74,7],[81,5,81,7],[82,5,82,7],[83,5,83,7],[90,5,90,7],[91,5,91,7],[92,5,92,7],[99,5,99,7],[100,5,100,7],[101,5,101,7],[108,5,108,7],[109,5,109,7],[110,5,110,7],[117,5,117,7],[118,5,118,7],[119,5,119,7],[126,5,126,7],[127,5,127,7],[128,5,128,7],[135,5,135,7],[136,5,136,7],[137,5,137,7],[144,5,144,7],[145,5,145,7],[146,5,146,7],[153,5,153,7],[154,5,154,7],[173,5,173,7],[180,5,180,7],[181,5,181,7],[182,5,182,7],[155,5,155,7],[162,5,162,7],[163,5,163,7],[164,5,164,7],[171,5,171,7],[172,5,172,7]]}
[null,null,null,null,null,null,null,"Impression sur pages A4 100% en format horizontal"]
[null,null,null,null,"  Résultats détaillés par DOCUMENT de l'autodiagnostic \"Performance du système documentaire\""]
[]
["Informations sur le Service Management de la Qualité",null,null,null,null,null,"Informations sur l'Autodiagnostic"]
[{"$f":"'Mode d''Emploi'!B5","v":"Etablissement :"},null,{"$f":"'Mode d''Emploi'!E5","v":"Nom de l'organisation"},null,{"$f":"Evaluation!A4","v":"Date de l'autodiagnostic : "},{"$f":"IF(Evaluation!C4=\"\",\"\",Evaluation!C4)","v":""},{"$f":"Evaluation!A7","v":"L'équipe d'autodiagnostic :"}]
[{"$f":"'Mode d''Emploi'!B6","v":" Responsable du SMQ : "},null,{"$f":"'Mode d''Emploi'!E6","v":"Nom du responsable du SMQ"},null,"Responsable : ",{"$f":"IF(Evaluation!C5=\"\",\"\",Evaluation!C5)","v":"Indiquez le nom du responsable de l'autodiagnostic"},{"$f":"Evaluation!C7","v":"Indiquez les noms des contributeurs à l'autodiagnostic"}]
[null,null,{"$f":"'Mode d''Emploi'!E7","v":"@"},{"$f":"'Mode d''Emploi'!I7","v":"Tél:"},{"$f":"IF(Evaluation!C6=\"\",\"\",Evaluation!C6)","v":"Tél :"},{"$f":"IF(Evaluation!E6=\"\",\"\",Evaluation!E6)","v":"@"}]
[]
[null,{"$f":"Evaluation!A11","v":"1."},{"$f":"Evaluation!B11","v":"Indiquez ici le titre du document"}]
[null,"Niveau d'évaluation"," Taux de PERFORMANCE",null,null,"COMMENTAIRES sur les RÉSULTATS obtenus"]
[null,{"$f":"'Résultats globaux'!E34","v":" "},{"$f":"'Résultats globaux'!G34","v":" "},null,null,"Commentaires (collectifs si possible)  :"]
[null,null,null,null,null,"DÉCISIONS : Plans d'action PRIORITAIRES"]
[null,null,null,null,null,"QUOI\nObjectifs à atteindre","QUI\nen Interne ou en Externe","QUAND ET OÙ\nDate et Champ d'application"]
[null,null,null,null,null,"Plan n°1 :"]
[null,null,null,null,null,"Plan n°2 :"]
{"$rows_left_out":263}
{"sheet":"Conseils","index":5,"n_rows":21,"n_cols":5,"rows_kept":21,"cut":false,"hidden":false,"merged":[[3,0,3,2],[6,4,8,4],[10,4,16,4],[18,4,20,4],[6,3,8,3],[10,3,16,3],[18,3,20,3]]}
[null,null,null,"  Autodiagnostic \"Performance du système documentaire\""]
[null,null,null,"Applicable avec la norme ISO 9001 \"Systèmes de management de la qualité - Exigences\", versions 2008 et 2015"]
[]
[null,null,null,"Quelques CONSEILS pour améliorer la performance documentaire…"]
[null,null,"Articles","Quoi","Qui"]
["Cr 1.","\"Utile\""]
[null,"1.1","Le document contribue à la réalisation d'une activité/à l'obtention de résultats.","L'organisme doit déterminer quelle est la plus value apportée par le document.\nDe plus, il est important de s'assurer de l'adéquation entre les attentes liées aux document (l'information correspond à ce qui est recherché) et son utilisateur (le bon acteur utilise le bon document).\nLes documents devront être revus régulièrement, afin de s'assurer qu'ils sont mis à jour et ajustés (en termes de contenu) autant que nécessaire.","Responsable Qualité et/ou Responsable du processus/de l'activité concernée"]
[null,"1.2","Le document est à jour, les données qu'il contient ne comportent pas d'erreurs."]
[null,"1.3","Le document est en adéquation avec les informations recherchées par l'utilisateur."]
["Cr 2.","\"Utilisable\""]
[null,"2.1","Le document est facile à utiliser (clair, voire ergonomique si applicable).","L'organisme doit s'assurer que le document est intuitif et \"orienté utilisateur\". Une manière de s'en assurer est que l'utilisateur soit associé à la création du document, de manière à pouvoir le comprendre immédiatement.\nDe plus la facilité d'utilisation tient aussi au choix du format du document et à la langue dans laquelle il est conçu, afin de réduire son temps d'utilisation. Enfin le document doit pouvoir être facilement trouvé, à l'aide d'un nom et/ou d'un emplacement clair.\nPar ailleurs un soin particulier doit être porté à la fiabilité du document. Lorsque cela est pertinent, le document doit pouvoir être facilement modifiable et améliorable. \nLa dernière version doit pouvoir être facilement repérée (date, numéro de version par exemple).","Responsable Qualité et/ou Responsable du processus/de l'activité concernée"]
[null,"2.2","Le temps passé à utiliser le document est cohérent avec l'activité réalisée/les résultats obtenus."]
[null,"2.3","Le document est compréhensible immédiatement, il n'est pas nécessaire d'interpréter son contenu."]
[null,"2.4","Le document ne comporte pas d'erreurs dans sa structure/conception (exemple : bugs, formules Excel…)."]
[null,"2.5","Le document est facile à trouver (emplacement, nom, date) et il est disponible à tout moment."]
{"$rows_left_out":7}
{"sheet":"Correspondance avec l'ISO 9001","index":6,"n_rows":19,"n_cols":4,"rows_kept":19,"cut":false,"hidden":false,"merged":[[3,1,3,3],[7,1,7,3],[15,1,15,3],[0,1,0,3],[1,0,1,3],[2,0,2,1]]}
[null,"  Autodiagnostic \"Performance du système documentaire\""]
["Correspondance entre les critères de l'outil d'autodiagnostic et les chapitres de l'ISO 9001, v. 2008 et 2015"]
["Liste des critères",null," ISO 9001 : 2008"," ISO 9001 : 2015"]
["Cr 1.","\"Utile\""]
["1.1","Le document contribue à la réalisation d'une activité/à l'obtention de résultats.","4.2.1","7.5.1"]
["1.2","Le document est à jour, les données qu'il contient ne comportent pas d'erreurs.","4.2.3","7.5.2 c)\n7.5.3.2 c)"]
["1.3","Le document est en adéquation avec les informations recherchées par l'utilisateur.","4.1","7.5.1\n7.5.2 a)"]
["Cr 2.","\"Utilisable\""]
["2.1","Le document est facile à utiliser (clair, voire ergonomique si applicable).","4.2.3\n4.2.4","7.5.2 b)\n7.5.3.1 a)\n7.5.3.2 a)"]
["2.2","Le temps passé à utiliser le document est cohérent avec l'activité réalisée/les résultats obtenus.","4.2.3\n4.2.4","7.5.2\n7.5.3.1 a)"]
["2.3","Le document est compréhensible immédiatement, il n'est pas nécessaire d'interpréter son contenu.","4.2.3\n4.2.4","7.5.2 a)"]
["2.4","Le document ne comporte pas d'erreurs dans sa structure/conception (exemple : bugs, formules Excel…).","4.2.3\n4.2.4","7.5.2 b)"]
["2.5","Le document est facile à trouver (emplacement, nom, date) et il est disponible à tout moment.","4.1\n4.2.3\n4.2.4","7.5.2 a)\n7.5.3.1\n7.5.3.2 a) / b) / d)"]
["2.6","Le document est facile à modifier, à mettre à jour.","4.2.3","7.5.2\n7.5.3.1\n7.5.3.2 c)"]
["2.7","La dernière version du document est clairement identifiée et facilement contrôlable.","4.1","7.5.2 a) / c)\n7.5.3.2 c)"]
{"$rows_left_out":4}