{"text_format":"1","workbook":"xlsx","n_sheets":6,"sheets":["Mode Emploi","Recommandations","Résultats globaux","Résultats par Article","Conseils","Déclaration ISO 17050"],"not_rendered":{"charts":8,"images":3,"macros":1,"external_links":1,"defined_names":14,"comments":1,"pivot_tables":0},"unopened":[],"bounds":{"document_bytes":16777216,"sheet_cells":100000,"rows_first":2000,"rows_last":500,"rows_between":2000,"halvings":0,"cell_chars":16384,"cell_head_chars":4096},"cells_cut":0,"cells_raw":0,"read":"whole","date_system":"1900"}

{"sheet":"Mode Emploi","index":0,"n_rows":21,"n_cols":14,"rows_kept":21,"cut":false,"hidden":false,"merged":[[1,3,1,9],[5,1,5,3],[6,1,6,3],[6,4,6,7],[2,3,2,9],[21,1,21,9],[16,1,16,2],[15,8,15,9],[16,8,16,9],[20,1,20,9],[19,1,19,2],[18,1,18,2],[17,1,17,2],[17,8,17,9],[18,8,18,9],[19,8,19,9],[13,1,13,9],[4,1,4,3],[4,4,4,9],[15,1,15,2],[3,1,3,9],[8,1,8,9],[9,1,12,9],[14,5,14,9],[5,4,5,9],[6,8,6,9],[14,1,14,4]]}
[null,null,null,null,null,null,null,null,null,"Enregistrement qualité :  A4 100% vertical"]
[null,null,null,"   Autodiagnostic selon la norme ISO/DIS 20700:2016"]
[null,null,null," \"Lignes directrices relatives aux services de conseil en management\", édition  Afnor, \nwww.afnor.org, mai 2016"]
[]
[null,"Etablissement :",null,null,"Nom de l'établissement / entreprise / organisation..."]
[null," Utilisateur : ",null,null,"NOM et Prénom"]
[null," Contact d'utilisateur :",null,null,"email :",null,null,null,"Tél :"]
[]
[null,"Mode d'emploi"]
[null,"\nOBJECTIF:   \nCet outil permet aux consultants de s'assurer de la conformité de leurs activités de conseil selon les exigences de la norme ISO/DIS 20700: 2016\nNB: Cet outil ne garantit pas une certification\n\nPRESENTATION DES ELEMENTS:  \nLa grille se présente sous format Excel constitué de six (6) onglets :\n    - Mode d'emploi :\n         * Explicite le fonctionnement de l'outil et les critères d'évaluation définis\n    - Recommandations : \n         * Définit des critères d'évaluation par article et sous article\n    - Résultats globaux :\n         * Affiche tous les résultats réunis sur une cartographie globale\n         * Permet de mettre en place un plan d'action en se basant sur les résultats globaux\n    - Résultats par article : \n         * Affiche un taux de CONFORMITÉ par article sous forme de graphe radar \n         * Permet de mettre en oeuvre un plan d'actions prioritaires\n     - Conseils : \n         * Expliquent globalement l'objet de chaque article de la norme\n    - Déclaration ISO 17050 : \n        * Permet au consultant de s'auto-déclarer conforme selon la norme 17050"]
[]
[null,null,null,null,null,null,null,null,null,null,null,null,"Utilitaires pour l'Autodiagnostic"]
[null,null,null,null,null,null,null,null,null,null,null,null,"Paramétrage des affectations selon le N° du choix"]
[null,null,null,null,null,null,null,null,null,null,null,null,"Utilisé pour  {Exigences} : affectation d'un N° selon le choix réalisé"]
[null,"Niveaux de VÉRACITÉ quant à la RÉALISATION \ndes actions associées aux recommandations de la norme",null,null,null,"LIBELLÉS des niveaux de CONFORMITÉ \ndes ARTICLES de la norme ",null,null,null,null,null,null,"Choix proposé","A faire en manuel\nN° du choix croissant selon son  Ordre Alphabétique : 1 à …"]
{"$rows_left_out":7}
{"sheet":"Recommandations","index":1,"n_rows":91,"n_cols":23,"rows_kept":91,"cut":false,"hidden":false,"merged":[[1,1,1,5],[39,4,39,5],[3,0,3,1],[2,0,2,1],[2,2,2,5],[3,2,3,4],[5,2,5,3],[4,0,5,1],[6,0,7,1],[6,2,7,4],[75,4,75,5],[41,4,41,5],[42,4,42,5],[3,5,7,5],[11,4,11,5],[35,4,35,5],[4,2,4,4],[10,4,10,5],[64,4,64,5],[65,4,65,5],[48,4,48,5],[50,4,50,5],[52,4,52,5],[76,4,76,5],[80,4,80,5],[85,4,85,5],[87,4,87,5],[82,4,82,5]]}
[{"$f":"'Mode Emploi'!B1","v":0},null,null,null,null,"Impression sur pages A4 100% en format horizontal"]
[null,"  Autodiagnostic sur les recommandations de l'ISO/DIS 20700:2016",null,null,null,null,null,null,null,null,null,null,null,null,null,null,"Somme des pondérations des Articles","Taux moyen de conformité sur la Norme","Niveau de RESPECT pour la norme"]
[{"$f":"'Mode Emploi'!B5","v":"Etablissement :"},null,{"$f":"'Mode Emploi'!E5","v":"Nom de l'établissement / entreprise / organisation..."},null,null,null,null,null,null,null,"Somme des pondérations sur les exigences","Taux  moyen de CONFORMITÉ pour le sous-article","Niveau de RESPECT pour le sous-article","Automatique : pondération de chaque sous- chapitre","Taux  moyen de CONFORMITÉ pondéré pour le sous-article"]
["Date de l'autodiagnostic : ",null,null,null,null,"Signature du responsable de l'autodiagnostic :\n\n\n\n\n"]
["Responsable de l'autodiagnostic : ",null,"NOM et Prénom",null,null,null,null,"Choix réalisé","N° du choix réalisé","% Véracité du choix","Automatique : pondération de chaque exigence","Taux de CONFORMITÉ pondéré sur l'exigence",null,null,null,"Resultats, Actions et REX "]
[null,null,"Tél :",null,"@ :"]
["L'équipe d'autodiagnostic :",null,"Noms et Prénoms des participants"]
[]
[]
["Réf.","Critères des recommandations des articles de la norme","Evaluations","Taux %","Libellés \ndes évaluations","Modes de preuve \net commentaires",null,null,null,null,null,null,null,null,null,null,null,null,null,null,null,"Choix proposé","A faire en manuel\nN° du choix croissant selon son  Ordre Alphabétique : 1 à …"]
["Art. 4","Principes",{"$f":"P11","v":"Insuffisant"},{"$f":"O11","v":0},{"$f":"IFERROR(IF(D11<='Mode Emploi'!$G$17,'Mode Emploi'!$I$17,IF(D11<='Mode Emploi'!$G$18,'Mode Emploi'!$I$18,IF(D11<='Mode Emploi'!$G$19,'Mode Emploi'!$I$19,'Mode Emploi'!$I$20))),\"\")","v":"Conformité de niveau 1 : Il est nécessaire de formaliser les activités réalisées."},null,null,"Article",null,null,null,null,"vérifier si Somme = 1 =>  ",{"$f":"SUM(N12:N41)","v":1},{"$f":"IFERROR(SUM(O12:O41),\"\")","v":0},{"$f":"IFERROR(IF(O11<='Mode Emploi'!$G$17,'Mode Emploi'!$H$17,IF(O11<='Mode Emploi'!$G$18,'Mode Emploi'!$H$18,IF(O11<='Mode Emploi'!$G$19,'Mode Emploi'!$H$19,'Mode Emploi'!$H$20))),\"\")","v":"Insuffisant"},{"$f":"1/7","v":0.14285714285714285},{"$f":"O11*Q11","v":0},null,null,null,"Choix de \nVÉRACITÉ",1]
["4.3","Politiques",{"$f":"M12","v":"Insuffisant"},{"$f":"L12","v":0},{"$f":"IFERROR(IF(D12<='Mode Emploi'!$G$17,'Mode Emploi'!$I$17,IF(D12<='Mode Emploi'!$G$18,'Mode Emploi'!$I$18,IF(D12<='Mode Emploi'!$G$19,'Mode Emploi'!$I$19,'Mode Emploi'!$I$20))),\"\")","v":"Conformité de niveau 1 : Il est nécessaire de formaliser les activités réalisées."},null,"Nb critères","Sous-Article",null,"vérifier si Somme = 1 =>  ",{"$f":"SUM(K13:K35)","v":0.99999999999999956},{"$f":"IFERROR(SUM(L13:L35),\"\")","v":0},{"$f":"IFERROR(IF(L12<='Mode Emploi'!$G$17,'Mode Emploi'!$H$17,IF(L12<='Mode Emploi'!$G$18,'Mode Emploi'!$H$18,IF(L12<='Mode Emploi'!$G$19,'Mode Emploi'!$H$19,'Mode Emploi'!$H$20))),\"\")","v":"Insuffisant"},{"$f":"1/COUNTA($M$12:$M$41)","v":0.33333333333333331},{"$f":"N12*L12","v":0},null,null,null,null,null,null,"Faux",2]
["cr 1","Le consultant a une bonne connaissance des lois et des réglementations liées ses services et à celles du client.","Choix de \nVÉRACITÉ",{"$f":"J13","v":""},{"$f":"CHOOSE(I13,\"Libellé du critère quand il sera choisi\",'Mode Emploi'!$B$17,'Mode Emploi'!$B$18,'Mode Emploi'!$B$19,'Mode Emploi'!$B$20,,)","v":"Libellé du critère quand il sera choisi"},null,1,{"$f":"C13","v":"Choix de \rVÉRACITÉ"},{"$f":"IFERROR((VLOOKUP(C13,'Mode Emploi'!$M$16:$N$20,2)),\"\")","v":1},{"$f":"IFERROR(CHOOSE(I13,\"\",'Mode Emploi'!$E$17,'Mode Emploi'!$E$18,'Mode Emploi'!$E$19,'Mode Emploi'!$E$20,),\"\")","v":""},{"$f":"1/COUNTA($B$13:$B$35)","v":4.3478260869565216E-2},{"$f":"IFERROR(J13*K13,\"\")","v":""},null,null,null,null,null,null,null,null,null,"Plutôt Faux",3]
[{"$f":"CONCATENATE(\"cr \",MID(A13,3,4)+1)","v":"cr 2"},"L’accord inclut l’accès aux informations, la consultation, la communication, les rôles et les responsabilités des parties prenantes.","Choix de \nVÉRACITÉ",{"$f":"J14","v":""},{"$f":"CHOOSE(I14,\"Libellé du critère quand il sera choisi\",'Mode Emploi'!$B$17,'Mode Emploi'!$B$18,'Mode Emploi'!$B$19,'Mode Emploi'!$B$20,,)","v":"Libellé du critère quand il sera choisi"},null,{"$f":"G13+1","v":2},{"$f":"C14","v":"Choix de \rVÉRACITÉ"},{"$f":"IFERROR((VLOOKUP(C14,'Mode Emploi'!$M$16:$N$20,2)),\"\")","v":1},{"$f":"IFERROR(CHOOSE(I14,\"\",'Mode Emploi'!$E$17,'Mode Emploi'!$E$18,'Mode Emploi'!$E$19,'Mode Emploi'!$E$20,),\"\")","v":""},{"$f":"1/COUNTA($B$13:$B$35)","v":4.3478260869565216E-2},{"$f":"IFERROR(J14*K14,\"\")","v":""},null,null,null,null,null,null,null,null,null,"Plutôt Vrai",4]
[{"$f":"CONCATENATE(\"cr \",MID(A14,3,4)+1)","v":"cr 3"},"Le code de conduite inclut des sujets majeurs tels que l'attitude professionnelle, le développement durable, la responsabilité sociale, le conflit d'intérêts et l'intégrité.","Choix de \nVÉRACITÉ","",{"$f":"CHOOSE(I15,\"Libellé du critère quand il sera choisi\",'Mode Emploi'!$B$17,'Mode Emploi'!$B$18,'Mode Emploi'!$B$19,'Mode Emploi'!$B$20,,)","v":"Libellé du critère quand il sera choisi"},null,{"$f":"G14+1","v":3},{"$f":"C15","v":"Choix de \rVÉRACITÉ"},{"$f":"IFERROR((VLOOKUP(C15,'Mode Emploi'!$M$16:$N$20,2)),\"\")","v":1},{"$f":"IFERROR(CHOOSE(I15,\"\",'Mode Emploi'!$E$17,'Mode Emploi'!$E$18,'Mode Emploi'!$E$19,'Mode Emploi'!$E$20,),\"\")","v":""},4.3478260869565216E-2,{"$f":"IFERROR(J15*K15,\"\")","v":""},null,null,null,null,null,null,null,null,null,"Vrai",5]
{"$rows_left_out":77}
{"sheet":"Résultats globaux","index":2,"n_rows":50,"n_cols":19,"rows_kept":50,"cut":false,"hidden":false,"merged":[[9,0,9,3],[24,5,24,7],[30,0,30,7],[28,0,28,4],[32,10,32,14],[3,0,3,3],[5,0,5,1],[6,0,6,1],[5,2,5,3],[23,5,23,7],[15,0,15,3],[5,6,6,7],[13,0,13,3],[9,4,9,7],[4,0,4,1],[4,2,4,3],[14,0,14,3],[22,0,22,4],[22,5,22,7],[8,0,8,7],[21,0,21,7]]}
[{"$f":"'Mode Emploi'!B1","v":0},null,null,null,null,null,null,"Impression sur pages A4 100% en format horizontal"]
[null,null,null,null,{"$f":"'Mode Emploi'!D2","v":"   Autodiagnostic selon la norme ISO/DIS 20700:2016"}]
[]
["Informations sur le prestataire de conseil",null,null,null,null,null,"Informations sur l'Autodiagnostic"]
[{"$f":"'Mode Emploi'!B5","v":"Etablissement :"},null,null,null,{"$f":"Recommandations!A4","v":"Date de l'autodiagnostic : "},{"$f":"IF(Recommandations!C4=\"\",\"\",Recommandations!C4)","v":""},{"$f":"Recommandations!A7","v":"L'équipe d'autodiagnostic :"}]
[{"$f":"'Mode Emploi'!B6","v":" Utilisateur : "},null,{"$f":"'Mode Emploi'!E6","v":"NOM et Prénom"},null,"Responsable : ",{"$f":"IF(Recommandations!C5=\"\",\"\",Recommandations!C5)","v":"NOM et Prénom"},{"$f":"Recommandations!C7","v":"Noms et Prénoms des participants"}]
[null,null,{"$f":"'Mode Emploi'!E7","v":"email :"},{"$f":"'Mode Emploi'!I7","v":"Tél :"},{"$f":"IF(Recommandations!C6=\"\",\"\",Recommandations!C6)","v":"Tél :"},{"$f":"IF(Recommandations!E6=\"\",\"\",Recommandations!E6)","v":"@ :"}]
[]
["TABLEAUX DE BORD sur les niveaux de CONFORMITÉ selon les recommandations de la norme ISO DIS 20700:2016",null,null,null,null,null,null,null,null,null,null,null,"Utilitaires pour les CALCULS et les GRAPHIQUES"]
["Niveaux de VÉRACITÉ des 65 critères d'exigence ",null,null,null,"Niveaux de CONFORMITÉ des ARTICLES aux recommandations de la norme"]
[null,null,null,null,null,"Moyenne générale :",{"$f":"G33","v":0},{"$f":"E33","v":"Insuffisant"},null,null,"Histogramme des niveaux de CONFORMITÉ",null,null,null,null,"Histogramme des niveaux de VÉRACITÉ"]
[null,null,null,null,null,null,null,null,null,null,"CONFORMITÉ","Nb d'Articles","Tracer la moyenne",null,"VÉRACITÉ",null,"Nb de critères d'exigences","Ecart vs Total des critères","Total des critères"]
[null,null,null,null,null,null,null,null,null,null,"Niveaux",{"$f":"SUM(L14:L17)","v":13},": Total ou 0",null,"Niveaux","N°",{"$f":"SUM(Q14:Q17)","v":0},{"$f":"154-Q13","v":154},{"$f":"MAX(Recommandations!G1:G92)","v":64}]
[null,null,null,null,null,null,null,null,null,null,{"$f":"'Mode Emploi'!H17","v":"Insuffisant"},{"$f":"IFERROR(COUNTIFS($F$35:$F$50,K14),0)","v":13},{"$f":"IF($E$33=K14,30,0)","v":30},null,"Faux",{"$f":"'Mode Emploi'!N17","v":2},{"$f":"IFERROR(COUNTIFS(Recommandations!$I$13:$I$91,$P14),0)","v":0}]
["Niveaux de CONFORMITÉ des 13 SOUS-ARTICLES de la norme (et Moyenne)",null,null,null,null,null,null,null,null,null,{"$f":"'Mode Emploi'!H18","v":"Informel"},{"$f":"IFERROR(COUNTIFS($F$35:$F$50,K15),0)","v":0},{"$f":"IF($E$33=K15,30,0)","v":0},null,"Plutôt Faux",{"$f":"'Mode Emploi'!N18","v":3},{"$f":"IFERROR(COUNTIFS(Recommandations!$I$13:$I$91,$P15),0)","v":0}]
{"$rows_left_out":36}
{"sheet":"Résultats par Article","index":3,"n_rows":43,"n_cols":8,"rows_kept":43,"cut":false,"hidden":false,"merged":[[37,5,37,7],[38,5,38,7],[10,5,10,7],[11,5,11,7],[5,0,5,1],[5,2,5,3],[6,0,6,1],[18,5,18,7],[19,5,19,7],[20,5,20,7],[27,5,27,7],[28,5,28,7],[29,5,29,7],[36,5,36,7],[4,0,4,1],[4,2,4,3],[5,6,6,7],[9,5,9,7],[1,0,1,7],[3,0,3,3]]}
[{"$f":"'Mode Emploi'!B1","v":0},null,null,null,null,null,null,"Impression sur pages A4 100% en format horizontal"]
["  Résultats détaillés par ARTICLE de l'autodiagnostic selon la norme ISO/DIS 20700:2016"]
[]
["Informations sur le Service Management de la Qualité",null,null,null,null,null,"Informations sur l'Autodiagnostic"]
[{"$f":"'Mode Emploi'!B5","v":"Etablissement :"},null,{"$f":"'Mode Emploi'!E5","v":"Nom de l'établissement / entreprise / organisation..."},null,{"$f":"Recommandations!A4","v":"Date de l'autodiagnostic : "},{"$f":"IF(Recommandations!C4=\"\",\"\",Recommandations!C4)","v":""},{"$f":"Recommandations!A7","v":"L'équipe d'autodiagnostic :"}]
[{"$f":"'Mode Emploi'!B6","v":" Utilisateur : "},null,{"$f":"'Mode Emploi'!E6","v":"NOM et Prénom"},null,"Responsable : ",{"$f":"IF(Recommandations!C5=\"\",\"\",Recommandations!C5)","v":"NOM et Prénom"},{"$f":"Recommandations!C7","v":"Noms et Prénoms des participants"}]
[null,null,{"$f":"'Mode Emploi'!E7","v":"email :"},{"$f":"'Mode Emploi'!I7","v":"Tél :"},{"$f":"IF(Recommandations!C6=\"\",\"\",Recommandations!C6)","v":"Tél :"},{"$f":"IF(Recommandations!E6=\"\",\"\",Recommandations!E6)","v":"@ :"}]
[]
[null,{"$f":"Recommandations!A11","v":"Art. 4"},{"$f":"Recommandations!B11","v":"Principes"}]
[null,"Niveau d'évaluation"," Taux de CONFORMITÉ aux critères d'exigence",null,null,"COMMENTAIRES sur les RÉSULTATS obtenus"]
[null,{"$f":"'Résultats globaux'!E34","v":"Insuffisant"},{"$f":"'Résultats globaux'!G34","v":0},null,null,"Commentaires (collectifs si possible)  :"]
[null,null,null,null,null,"DÉCISIONS : Plans d'action PRIORITAIRES"]
[null,null,null,null,null,"QUOI\nObjectifs à atteindre","QUI\nen Interne ou en Externe","QUAND ET OÙ\nDate et Champ d'application"]
[null,null,null,null,null,"Plan n°1 :","                            "]
[null,null,null,null,null,"Plan n°2 :"]
{"$rows_left_out":29}
{"sheet":"Conseils","index":4,"n_rows":22,"n_cols":5,"rows_kept":22,"cut":false,"hidden":false,"merged":[[3,0,3,2],[9,0,9,4],[5,0,5,4],[14,0,14,4],[10,3,13,3],[17,3,21,3],[17,4,21,4],[10,4,13,4],[6,4,8,4],[6,3,8,3],[16,0,16,4]]}
[null,null,null,"   Autodiagnostic selon la norme ISO/DIS 20700:2016"]
[null,null,null,"\"Lignes directrices relatives aux services de conseil en management\", édition  Afnor, \nwww.afnor.org, mai 2016"]
[]
[null,null,null,"Quelques CONSEILS pour atteindre le respect des exigences..."]
[null,null,"Articles","Quoi","Qui"]
["Art. 4    Principes"]
[null,"4.3","Politique ","Au cours d'une mission type, le consultant et le client entreprennent un ensemble d'activités requises pour parvenir aux objectifs et aux changements convenus. Ces activités sont généralement appelées  « le processus de conseil » .","Le consultant et le client"]
[null,"4.4","Evaluation et amélioration continues"]
[null,"4.5","Réclamation et litiges"]
["Art. 5    Proposition"]
[null,"5.1","Généralités","La proposition constitue la première phase d'une mission de conseil. Le consultant acquiert une compréhension de la situation et des problématiques du client ; le client comprend la capacité d'intervention du consultant par rapport à ses problématiques. Le consultant et le client concluent un accord clair sur le périmètre et l'approche du service à fournir, et s'engagent à travailler ensemble.","Le consultant et le client"]
[null,"5.2","Objectifs "]
[null,"5.3","Données d’entrée"]
[null,"5.4","Résultats "]
["Art. 6    Réalisation "]
{"$rows_left_out":8}
{"sheet":"Déclaration ISO 17050","index":5,"n_rows":34,"n_cols":6,"rows_kept":34,"cut":false,"hidden":false,"merged":[[32,0,32,2],[28,0,28,2],[28,3,28,5],[29,0,29,2],[29,3,29,5],[30,0,30,2],[30,3,30,4],[27,0,27,2],[27,3,27,5],[17,0,17,5],[18,0,18,5],[19,0,19,2],[19,3,19,5],[20,0,20,2],[20,3,20,5],[21,0,21,2],[21,3,21,5],[23,0,23,5],[25,0,25,2],[25,3,25,5],[11,0,11,3],[1,0,1,5],[2,0,2,5],[3,0,3,2],[3,3,3,5],[4,0,4,2],[4,3,4,5],[6,0,6,5],[7,0,7,5],[8,0,8,5],[9,0,9,5],[10,0,10,3]]}
[" Fiche de déclaration de conformité par une première partie - norme ISO 17050",null,null,null,null,"Enregistrement qualité : impression sur 1 page A4 100% en vertical"]
["Déclaration de conformité selon la norme NF EN ISO 17050 Partie 1 : Exigences générales"]
["Évaluation de la conformité - Déclaration de conformité du fournisseur (NF EN ISO/CEI 17050-1)"]
["Date limite de validité de la déclaration :",null,null,"Référence unique de la déclaration ISO 17050 :"]
[{"$f":"IFERROR(A33+364,\"Date de la déclaration + 1 an\")","v":"Date de la déclaration + 1 an"},null,null,{"$f":"IF(A33=\"\",\"remplir la cellule de date de la déclaration (onglet ISO 17050)\",IF(ISERROR(YEAR(A33)),\"date de la déclaration invalide\",CONCATENATE(\"Autodeclaration_ISO_17050_sur_la_NF_S99-170_en_\",YEAR(A33),\"_\",MONTH(A33),\"_\",DAY(A33))))","v":"date de la déclaration invalide"}]
[]
["Objet de la déclaration : Niveau de CONFORMITÉ aux EXIGENCES de la norme ISO DIS 20700:2016"]
[{"$f":"'Mode Emploi'!E5","v":"Nom de l'établissement / entreprise / organisation..."}]
["Nous soussigés, déclarons sous notre propre responsabilité que les niveaux de conformité de nos pratiques professionnelles ont été mesurés d'après les exigences de la norme ISO/DIS 20700:2016."]
["Nous avons appliqué la meilleure rigueur d'élaboration et d'analyse (évaluation par plusieurs personnes compétentes) et nous avons respecté les règles d'éthique professionnelle (absence de conflits d'intérêt, respect des opinions, liberté des choix) pour parvenir aux résultats ci-dessous."]
["Tableau des résultats de CONFORMITÉ de nos activités \nselon les critères d'exigence tirés de la norme ISO DIS 20700:2016",null,null,null,"Taux moyen","Niveaux de Conformité"]
["Niveau moyen sur l'ensemble des articles de la norme ISO DIS 20700:2016:",null,null,null,{"$f":"'Résultats globaux'!G33","v":0},{"$f":"IF(E12>='Mode Emploi'!$F$19,\"Déclarable\",\"Non déclarable\")","v":"Non déclarable"}]
[{"$f":"'Résultats globaux'!A34","v":"Art. 4"},{"$f":"'Résultats globaux'!B34","v":"Principes"},null,null,{"$f":"'Résultats globaux'!G34","v":0},{"$f":"IF(E13>='Mode Emploi'!$F$19,\"Déclarable\",\"Non déclarable\")","v":"Non déclarable"}]
[{"$f":"'Résultats globaux'!A38","v":"Art. 5"},{"$f":"'Résultats globaux'!B38","v":"Proposition"},null,null,{"$f":"'Résultats globaux'!G38","v":0},{"$f":"IF(E14>='Mode Emploi'!$F$19,\"Déclarable\",\"Non déclarable\")","v":"Non déclarable"}]
[{"$f":"'Résultats globaux'!A43","v":"Art. 6"},{"$f":"'Résultats globaux'!B43","v":"Réalisation"},null,null,{"$f":"'Résultats globaux'!G43","v":0},{"$f":"IF(E15>='Mode Emploi'!$F$19,\"Déclarable\",\"Non déclarable\")","v":"Non déclarable"}]
{"$rows_left_out":19}