{"text_format":"1","workbook":"xlsx","n_sheets":7,"sheets":["Mode Emploi","Exigences","Résultats globaux","Résultats par Article","Conseils","Plans d'action détaillés","Déclaration ISO 17050"],"not_rendered":{"charts":11,"images":0,"macros":1,"external_links":0,"defined_names":15,"comments":1,"pivot_tables":0},"unopened":[],"bounds":{"document_bytes":16777216,"sheet_cells":100000,"rows_first":2000,"rows_last":500,"rows_between":2000,"halvings":0,"cell_chars":16384,"cell_head_chars":4096},"cells_cut":0,"cells_raw":0,"read":"whole","date_system":"1900"}

{"sheet":"Mode Emploi","index":0,"n_rows":18,"n_cols":14,"rows_kept":18,"cut":false,"hidden":false,"merged":[[6,1,9,9],[11,5,11,9],[11,1,11,4],[1,1,2,9],[18,1,18,9],[13,1,13,2],[12,8,12,9],[13,8,13,9],[17,1,17,9],[16,1,16,2],[15,1,15,2],[14,1,14,2],[14,8,14,9],[15,8,15,9],[16,8,16,9],[10,1,10,9],[12,1,12,2],[3,1,3,9],[5,1,5,9]]}
[null,"Document d'appui à la déclaration première partie de conformité à la norme ISO 9001:2015",null,null,null,null,null,null,null,"Enregistrement qualité :  A4 100% vertical"]
[null,"   Autodiagnostic selon la norme ISO 9001:2015"]
[]
[]
[]
[null,"Mode d'emploi"]
[null,"\nOBJECTIF:   \nCet outil permet aux différents utilisateurs, et en particulier aux responsables qualité d'un organisme, d'évaluer la conformité du système de management de la qualité selon les exigences de la norme ISO 9001:2015. Il sert aussi de tableau de bord pour votre système de management de la qualité avec lequel vous pouvez commenter et évaluer la progression de votre SMQ. Ainsi, il vous donnera plus de visibilité afin d'élaborer des actions d'amélioration continue. \n(NB : Cet outil ne garantit pas une certification)\n\nPRESENTATION DES ELEMENTS:  \nLa grille se présente sous format Excel constitué de cinq (7) onglets :\n    - Mode d'emploi :\n         * Explicite le fonctionnement de l'outil et les critères d'évaluation définis\n    - Exigences : \n         * Des critères d'évaluation par article et sous article sont définis\n         * Des commentaires explicitent les critères aux utilisateurs\n    - Résultats et Actions :\n         * Tous les résultats sont réunis sur cet onglet avec une cartographie globale du SMQ\n    - Résultats par article : \n         * Taux de CONFORMITÉ sous forme radar\n         * Les plans d'action prioritaires à mettre en œuvre et à déployer (Quoi, Qui, Quand...)                                                                                                -   - Conseils : \n         * Expliquent globalement l'objet de chaque article de la norme  \n    - Plans d'action détaillés\n         * Suivre et tracer les plans d'action définis\n   - Déclaration de conformité\n         * Usage de l'ISO 17050 pour déclarer ses résultats s'ils sont considérés comme probants et communicables"]
[]
[null,null,null,null,null,null,null,null,null,null,null,null,"Utilitaires pour l'Autodiagnostic"]
[null,null,null,null,null,null,null,null,null,null,null,null,"Paramétrage des affectations selon le N° du choix"]
[null,null,null,null,null,null,null,null,null,null,null,null,"Utilisé pour  {Exigences} : affectation d'un N° selon le choix réalisé"]
[null,"Niveaux de VÉRACITÉ quant à la RÉALISATION \ndes actions associées aux exigences de la norme",null,null,null,"LIBELLÉS des niveaux de CONFORMITÉ \ndes ARTICLES de la norme ",null,null,null,null,null,null,"Choix proposé","A faire en manuel\nN° du choix croissant selon son  Ordre Alphabétique : 1 à …"]
[null,"Libellés explicites \ndes niveaux de VÉRACITÉ",null,"Choix de \nVÉRACITÉ","Taux de \nVÉRACITÉ","Taux moyen \nMinimal","Taux moyen\nMaximal","Niveaux de CONFORMITÉ","Libellés explicites \ndes niveaux de CONFORMITÉ",null,null,null,{"$f":"D13","v":"Choix de \nVÉRACITÉ"},1]
[null,"Niveau 1 : L'action n'est pas réalisée ou alors de manière très aléatoire.",null,"Faux",0,0,{"$f":"F15-0.01","v":9.0000000000000011E-2},"Insuffisant","Conformité de niveau 1 : Il est nécessaire de formaliser les activités réalisées.",null,null,null,{"$f":"D14","v":"Faux"},2]
[null,"Niveau 2 : L'action est réalisée quelques fois de manière informelle.",null,"Plutôt Faux",{"$f":"(F15+G15)/2","v":0.29499999999999998},0.1,{"$f":"F16-0.01","v":0.49},"Informel","Conformité de niveau 2 : Il est nécessaire de pérenniser la bonne exécution des activités.",null,null,null,{"$f":"D15","v":"Plutôt Faux"},3]
{"$rows_left_out":4}
{"sheet":"Exigences","index":1,"n_rows":189,"n_cols":32,"rows_kept":189,"cut":false,"hidden":false,"merged":[[7,31,7,33],[8,31,8,33],[6,31,6,33],[185,6,185,7],[171,6,171,7],[172,6,172,7],[177,6,177,7],[95,6,95,7],[96,6,96,7],[105,6,105,7],[166,6,166,7],[153,6,153,7],[154,6,154,7],[160,6,160,7],[143,6,143,7],[147,6,147,7],[130,6,130,7],[136,6,136,7],[116,6,116,7],[59,6,59,7],[73,6,73,7],[82,6,82,7],[87,6,87,7],[78,6,78,7],[13,6,13,7],[1,0,1,7],[58,6,58,7],[26,6,26,7],[27,6,27,7],[5,6,5,7],[9,6,9,7],[18,6,18,7],[4,6,4,7],[53,6,53,7],[41,6,41,7],[42,6,42,7],[47,6,47,7],[33,6,33,7],[37,6,37,7]]}
[{"$f":"'Mode Emploi'!B1","v":"Document d'appui à la déclaration première partie de conformité à la norme ISO 9001:2015"},null,null,null,null,null,null,"Impression sur pages A4 100% en format horizontal"]
["  Autodiagnostic sur les exigences de l'ISO 9001:2015",null,null,null,null,null,null,null,null,null,null,null,null,null,null,null,null,null,"Somme des pondérations des Articles","Taux moyen de conformité sur la Norme","Niveau de RESPECT pour la norme"]
[]
["Réf.\n2015","Réf.\n2008","C-L\n4.5","Critères d'exigence des articles de la norme","Evaluations","Taux %","Libellés \ndes évaluations","Modes de preuve \net commentaires",null,null,null,null,null,null,null,null,null,null,null,null,null,null,null,"Choix proposé","A faire en manuel\nN° du choix croissant selon son  Ordre Alphabétique : 1 à …"]
["Art. 4","Art 4","1-2-3","Contexte de l'organisme",{"$f":"R5","v":"Insuffisant"},{"$f":"Q5","v":0},{"$f":"IFERROR(IF(F5<='Mode Emploi'!$G$14,'Mode Emploi'!$I$14,IF(F5<='Mode Emploi'!$G$15,'Mode Emploi'!$I$15,IF(F5<='Mode Emploi'!$G$16,'Mode Emploi'!$I$16,'Mode Emploi'!$I$17))),\"\")","v":"Conformité de niveau 1 : Il est nécessaire de formaliser les activités réalisées."},null,null,"Article",null,null,null,null,"vérifier si Somme = 1 =>  ",{"$f":"SUM(P6:P26)","v":1},{"$f":"IFERROR(SUM(Q6:Q26),\"\")","v":0},{"$f":"IFERROR(IF(Q5<='Mode Emploi'!$G$14,'Mode Emploi'!$H$14,IF(Q5<='Mode Emploi'!$G$15,'Mode Emploi'!$H$15,IF(Q5<='Mode Emploi'!$G$16,'Mode Emploi'!$H$16,'Mode Emploi'!$H$17))),\"\")","v":"Insuffisant"},{"$f":"1/7","v":0.14285714285714285},{"$f":"Q5*S5","v":0},null,null,null,"Choix de \nVÉRACITÉ",1]
["4.1","4.1","1.1.1.1\n1.4.1.1\n3.2.1.1","Compréhension de l'organisme et de son contexte",{"$f":"O6","v":"Insuffisant"},{"$f":"N6","v":0},{"$f":"IFERROR(IF(F6<='Mode Emploi'!$G$14,'Mode Emploi'!$I$14,IF(F6<='Mode Emploi'!$G$15,'Mode Emploi'!$I$15,IF(F6<='Mode Emploi'!$G$16,'Mode Emploi'!$I$16,'Mode Emploi'!$I$17))),\"\")","v":"Conformité de niveau 1 : Il est nécessaire de formaliser les activités réalisées."},null,"Nb critères","Sous-Article",null,"vérifier si Somme = 1 =>  ",{"$f":"SUM(M7:M9)","v":1},{"$f":"IFERROR(SUM(N7:N9),\"\")","v":0},{"$f":"IFERROR(IF(N6<='Mode Emploi'!$G$14,'Mode Emploi'!$H$14,IF(N6<='Mode Emploi'!$G$15,'Mode Emploi'!$H$15,IF(N6<='Mode Emploi'!$G$16,'Mode Emploi'!$H$16,'Mode Emploi'!$H$17))),\"\")","v":"Insuffisant"},{"$f":"1/COUNTA($O$6:$O$26)","v":0.25},{"$f":"P6*N6","v":0},null,null,null,null,null,null,"Faux",2,null,null,null,null,null,"Légende"]
["cr 1",null,null,"Les enjeux internes et externes sont déterminés relativement à la finalité et l'orientation stratégique de l'organisme influant sur sa capacité à atteindre le/les objectif(s)","Choix de \nVÉRACITÉ",{"$f":"L7","v":""},{"$f":"CHOOSE(K7,\"Libellé du critère quand il sera choisi\",'Mode Emploi'!$B$14,'Mode Emploi'!$B$15,'Mode Emploi'!$B$16,'Mode Emploi'!$B$17,,)","v":"Libellé du critère quand il sera choisi"},null,1,{"$f":"E7","v":"Choix de \nVÉRACITÉ"},{"$f":"IFERROR((VLOOKUP(E7,'Mode Emploi'!$M$13:$N$17,2)),\"\")","v":1},{"$f":"IFERROR(CHOOSE(K7,\"\",'Mode Emploi'!$E$14,'Mode Emploi'!$E$15,'Mode Emploi'!$E$16,'Mode Emploi'!$E$17,),\"\")","v":""},{"$f":"1/COUNTA($D$7:$D$9)","v":0.33333333333333331},{"$f":"IFERROR(L7*M7,\"\")","v":""},null,null,null,null,null,null,null,null,null,"Plutôt Faux",3,null,null,null,null,null,null,"Evolutions sans impact ou à impact limité"]
[{"$f":"CONCATENATE(\"cr \",MID(A7,3,4)+1)","v":"cr 2"},null,null,"Les informations relatives aux enjeux externes et internes sont surveillées et revues périodiquement","Choix de \nVÉRACITÉ",{"$f":"L8","v":""},{"$f":"CHOOSE(K8,\"Libellé du critère quand il sera choisi\",'Mode Emploi'!$B$14,'Mode Emploi'!$B$15,'Mode Emploi'!$B$16,'Mode Emploi'!$B$17,,)","v":"Libellé du critère quand il sera choisi"},null,{"$f":"I7+1","v":2},{"$f":"E8","v":"Choix de \nVÉRACITÉ"},{"$f":"IFERROR((VLOOKUP(E8,'Mode Emploi'!$M$13:$N$17,2)),\"\")","v":1},{"$f":"IFERROR(CHOOSE(K8,\"\",'Mode Emploi'!$E$14,'Mode Emploi'!$E$15,'Mode Emploi'!$E$16,'Mode Emploi'!$E$17,),\"\")","v":""},{"$f":"1/COUNTA($D$7:$D$9)","v":0.33333333333333331},{"$f":"IFERROR(L8*M8,\"\")","v":""},null,null,null,null,null,null,null,null,null,"Plutôt Vrai",4,null,null,null,null,null,null,"Evolutions à impact moyen"]
[{"$f":"CONCATENATE(\"cr \",MID(A8,3,4)+1)","v":"cr 3"},null,null,"Les facteurs d'influence sur l'efficacté du Système de Management de la Qualité (SMQ) sont identifiés","Choix de \nVÉRACITÉ",{"$f":"L9","v":""},{"$f":"CHOOSE(K9,\"Libellé du critère quand il sera choisi\",'Mode Emploi'!$B$14,'Mode Emploi'!$B$15,'Mode Emploi'!$B$16,'Mode Emploi'!$B$17,,)","v":"Libellé du critère quand il sera choisi"},null,{"$f":"I8+1","v":3},{"$f":"E9","v":"Choix de \nVÉRACITÉ"},{"$f":"IFERROR((VLOOKUP(E9,'Mode Emploi'!$M$13:$N$17,2)),\"\")","v":1},{"$f":"IFERROR(CHOOSE(K9,\"\",'Mode Emploi'!$E$14,'Mode Emploi'!$E$15,'Mode Emploi'!$E$16,'Mode Emploi'!$E$17,),\"\")","v":""},{"$f":"1/COUNTA($D$7:$D$9)","v":0.33333333333333331},{"$f":"IFERROR(L9*M9,\"\")","v":""},null,null,null,null,null,null,null,null,null,"Vrai",5,null,null,null,null,null,null,"Evolutions à fort impact"]
["4.2","4.2","1.1.1.1\n2.1.3.1\n3.2.1.1","Compréhension des besoins et des attentes des parties intéressées",{"$f":"O10","v":"Insuffisant"},{"$f":"N10","v":0},{"$f":"IFERROR(IF(F10<='Mode Emploi'!$G$14,'Mode Emploi'!$I$14,IF(F10<='Mode Emploi'!$G$15,'Mode Emploi'!$I$15,IF(F10<='Mode Emploi'!$G$16,'Mode Emploi'!$I$16,'Mode Emploi'!$I$17))),\"\")","v":"Conformité de niveau 1 : Il est nécessaire de formaliser les activités réalisées."},null,null,"Sous-Article",null,"vérifier si Somme = 1 =>  ",{"$f":"SUM(M11:M13)","v":1},{"$f":"IFERROR(SUM(N11:N13),\"\")","v":0},{"$f":"IFERROR(IF(N10<='Mode Emploi'!$G$14,'Mode Emploi'!$H$14,IF(N10<='Mode Emploi'!$G$15,'Mode Emploi'!$H$15,IF(N10<='Mode Emploi'!$G$16,'Mode Emploi'!$H$16,'Mode Emploi'!$H$17))),\"\")","v":"Insuffisant"},{"$f":"1/COUNTA($O$6:$O$26)","v":0.25},{"$f":"P10*N10","v":0}]
[{"$f":"CONCATENATE(\"cr \",MID(A9,3,4)+1)","v":"cr 4"},null,null,"Les parties intéressées pertinentes sont identifiées dans la cadre du SMQ","Choix de \nVÉRACITÉ",{"$f":"L11","v":""},{"$f":"CHOOSE(K11,\"Libellé du critère quand il sera choisi\",'Mode Emploi'!$B$14,'Mode Emploi'!$B$15,'Mode Emploi'!$B$16,'Mode Emploi'!$B$17,,)","v":"Libellé du critère quand il sera choisi"},null,{"$f":"I9+1","v":4},{"$f":"E11","v":"Choix de \nVÉRACITÉ"},{"$f":"IFERROR((VLOOKUP(E11,'Mode Emploi'!$M$13:$N$17,2)),\"\")","v":1},{"$f":"IFERROR(CHOOSE(K11,\"\",'Mode Emploi'!$E$14,'Mode Emploi'!$E$15,'Mode Emploi'!$E$16,'Mode Emploi'!$E$17,),\"\")","v":""},{"$f":"1/COUNTA($D$11:$D$13)","v":0.33333333333333331},{"$f":"IFERROR(L11*M11,\"\")","v":""}]
[{"$f":"CONCATENATE(\"cr \",MID(A11,3,4)+1)","v":"cr 5"},null,null,"Les exigences  des clients ainsi que celles légales et réglementaires sont prises en considération dans le SMQ","Choix de \nVÉRACITÉ",{"$f":"L12","v":""},{"$f":"CHOOSE(K12,\"Libellé du critère quand il sera choisi\",'Mode Emploi'!$B$14,'Mode Emploi'!$B$15,'Mode Emploi'!$B$16,'Mode Emploi'!$B$17,,)","v":"Libellé du critère quand il sera choisi"},null,{"$f":"I11+1","v":5},{"$f":"E12","v":"Choix de \nVÉRACITÉ"},{"$f":"IFERROR((VLOOKUP(E12,'Mode Emploi'!$M$13:$N$17,2)),\"\")","v":1},{"$f":"IFERROR(CHOOSE(K12,\"\",'Mode Emploi'!$E$14,'Mode Emploi'!$E$15,'Mode Emploi'!$E$16,'Mode Emploi'!$E$17,),\"\")","v":""},{"$f":"1/COUNTA($D$11:$D$13)","v":0.33333333333333331},{"$f":"IFERROR(L12*M12,\"\")","v":""}]
[{"$f":"CONCATENATE(\"cr \",MID(A12,3,4)+1)","v":"cr 6"},null,null,"Les informations sur les parties intéressées et leurs exigences sont surveillées et revues périodiquement","Choix de \nVÉRACITÉ",{"$f":"L13","v":""},{"$f":"CHOOSE(K13,\"Libellé du critère quand il sera choisi\",'Mode Emploi'!$B$14,'Mode Emploi'!$B$15,'Mode Emploi'!$B$16,'Mode Emploi'!$B$17,,)","v":"Libellé du critère quand il sera choisi"},null,{"$f":"I12+1","v":6},{"$f":"E13","v":"Choix de \nVÉRACITÉ"},{"$f":"IFERROR((VLOOKUP(E13,'Mode Emploi'!$M$13:$N$17,2)),\"\")","v":1},{"$f":"IFERROR(CHOOSE(K13,\"\",'Mode Emploi'!$E$14,'Mode Emploi'!$E$15,'Mode Emploi'!$E$16,'Mode Emploi'!$E$17,),\"\")","v":""},{"$f":"1/COUNTA($D$11:$D$13)","v":0.33333333333333331},{"$f":"IFERROR(L13*M13,\"\")","v":""}]
["4.3","4.2.2","1.2.1.1","Détermination du domaine d'application du système de management de la qualité",{"$f":"O14","v":"Insuffisant"},{"$f":"N14","v":0},{"$f":"IFERROR(IF(F14<='Mode Emploi'!$G$14,'Mode Emploi'!$I$14,IF(F14<='Mode Emploi'!$G$15,'Mode Emploi'!$I$15,IF(F14<='Mode Emploi'!$G$16,'Mode Emploi'!$I$16,'Mode Emploi'!$I$17))),\"\")","v":"Conformité de niveau 1 : Il est nécessaire de formaliser les activités réalisées."},null,null,"Sous-Article",null,"vérifier si Somme = 1 =>  ",{"$f":"SUM(M15:M18)","v":1},{"$f":"IFERROR(SUM(N15:N18),\"\")","v":0},{"$f":"IFERROR(IF(N14<='Mode Emploi'!$G$14,'Mode Emploi'!$H$14,IF(N14<='Mode Emploi'!$G$15,'Mode Emploi'!$H$15,IF(N14<='Mode Emploi'!$G$16,'Mode Emploi'!$H$16,'Mode Emploi'!$H$17))),\"\")","v":"Insuffisant"},{"$f":"1/COUNTA($O$6:$O$26)","v":0.25},{"$f":"P14*N14","v":0}]
[{"$f":"CONCATENATE(\"cr \",MID(A13,3,4)+1)","v":"cr 7"},null,null,"Le domaine d'application du SMQ est établi en déterminant ses limites et son applicabilité","Choix de \nVÉRACITÉ",{"$f":"L15","v":""},{"$f":"CHOOSE(K15,\"Libellé du critère quand il sera choisi\",'Mode Emploi'!$B$14,'Mode Emploi'!$B$15,'Mode Emploi'!$B$16,'Mode Emploi'!$B$17,,)","v":"Libellé du critère quand il sera choisi"},null,{"$f":"I13+1","v":7},{"$f":"E15","v":"Choix de \nVÉRACITÉ"},{"$f":"IFERROR((VLOOKUP(E15,'Mode Emploi'!$M$13:$N$17,2)),\"\")","v":1},{"$f":"IFERROR(CHOOSE(K15,\"\",'Mode Emploi'!$E$14,'Mode Emploi'!$E$15,'Mode Emploi'!$E$16,'Mode Emploi'!$E$17,),\"\")","v":""},{"$f":"1/COUNTA($D$15:$D$18)","v":0.25},{"$f":"IFERROR(L15*M15,\"\")","v":""}]
{"$rows_left_out":175}
{"sheet":"Résultats globaux","index":2,"n_rows":64,"n_cols":19,"rows_kept":64,"cut":false,"hidden":false,"merged":[[5,0,5,3],[20,5,20,7],[26,0,26,7],[24,0,24,4],[1,0,1,7],[19,5,19,7],[11,0,11,3],[9,0,9,3],[5,4,5,7],[10,0,10,3],[18,0,18,4],[18,5,18,7],[4,0,4,7],[17,0,17,7]]}
[{"$f":"'Mode Emploi'!B1","v":"Document d'appui à la déclaration première partie de conformité à la norme ISO 9001:2015"},null,null,null,null,null,null,"Impression sur pages A4 100% en format horizontal"]
[{"$f":"'Mode Emploi'!B2","v":"   Autodiagnostic selon la norme ISO 9001:2015"}]
[]
[]
["TABLEAUX DE BORD sur les niveaux de CONFORMITÉ et de RÉALISATION selon les exigences de la norme ISO 9001:2015",null,null,null,null,null,null,null,null,null,null,null,"Utilitaires pour les CALCULS et les GRAPHIQUES"]
[{"$f":"CONCATENATE(\"Niveaux de VÉRACITÉ des \", S9, \" critères d'exigence \")","v":{"$error":"#REF!"}},null,null,null,"Niveaux de CONFORMITÉ des ARTICLES aux exigences de la norme"]
[null,null,null,null,null,"Moyenne générale :",{"$f":"G29","v":0},{"$f":"E29","v":"Insuffisant"},null,null,"Histogramme des niveaux de CONFORMITÉ",null,null,null,null,"Histogramme des niveaux de VÉRACITÉ"]
[null,null,null,null,null,null,null,null,null,null,"CONFORMITÉ","Nb d'Articles","Tracer la moyenne",null,"VÉRACITÉ",null,"Nb de critères d'exigences","Ecart vs Total des critères","Total des critères"]
[null,null,null,null,null,null,null,null,null,null,"Niveaux",{"$f":"SUM(L10:L13)","v":28},": Total ou 0",null,"Niveaux","N°",{"$f":"SUM(Q10:Q13)","v":0},{"$f":"154-Q9","v":154},{"$f":"MAX(Exigences!I1:I190)","v":{"$error":"#REF!"}}]
[{"$f":"IF(Q9<S9,CONCATENATE(\"Attention : \",R9,\" critères ne sont pas encore traités\"),\"\")","v":{"$error":"#REF!"}},null,null,null,null,null,null,null,null,null,{"$f":"'Mode Emploi'!H14","v":"Insuffisant"},{"$f":"IFERROR(COUNTIFS($F$31:$F$64,K10),0)","v":28},{"$f":"IF($E$29=K10,30,0)","v":30},null,"Faux",{"$f":"'Mode Emploi'!N14","v":2},{"$f":"IFERROR(COUNTIFS(Exigences!$K$7:$K$189,$P10),0)","v":0}]
["Niveaux de CONFORMITÉ des 28 SOUS-ARTICLES de la norme (et Moyenne)",null,null,null,null,null,null,null,null,null,{"$f":"'Mode Emploi'!H15","v":"Informel"},{"$f":"IFERROR(COUNTIFS($F$31:$F$64,K11),0)","v":0},{"$f":"IF($E$29=K11,30,0)","v":0},null,"Plutôt Faux",{"$f":"'Mode Emploi'!N15","v":3},{"$f":"IFERROR(COUNTIFS(Exigences!$K$7:$K$189,$P11),0)","v":0}]
[null,null,null,null,null,null,null,null,null,null,{"$f":"'Mode Emploi'!H16","v":"Convaincant"},{"$f":"IFERROR(COUNTIFS($F$31:$F$64,K12),0)","v":0},{"$f":"IF($E$29=K12,30,0)","v":0},null,"Plutôt Vrai",{"$f":"'Mode Emploi'!N16","v":4},{"$f":"IFERROR(COUNTIFS(Exigences!$K$7:$K$189,$P12),0)","v":0}]
[null,null,null,null,null,null,null,null,null,null,{"$f":"'Mode Emploi'!H17","v":"Conforme"},{"$f":"IFERROR(COUNTIFS($F$31:$F$64,K13),0)","v":0},{"$f":"IF($E$29=K13,30,0)","v":0},null,"Vrai",{"$f":"'Mode Emploi'!N17","v":5},{"$f":"IFERROR(COUNTIFS(Exigences!$K$7:$K$189,$P13),0)","v":0}]
[]
[]
{"$rows_left_out":50}
{"sheet":"Résultats par Article","index":3,"n_rows":66,"n_cols":8,"rows_kept":66,"cut":false,"hidden":false,"merged":[[5,5,5,7],[16,5,16,7],[23,5,23,7],[24,5,24,7],[25,5,25,7],[15,5,15,7],[32,5,32,7],[1,0,1,7],[61,5,61,7],[50,5,50,7],[51,5,51,7],[52,5,52,7],[41,5,41,7],[42,5,42,7],[43,5,43,7],[59,5,59,7],[60,5,60,7],[33,5,33,7],[34,5,34,7],[6,5,6,7],[7,5,7,7],[14,5,14,7]]}
[{"$f":"'Mode Emploi'!B1","v":"Document d'appui à la déclaration première partie de conformité à la norme ISO 9001:2015"},null,null,null,null,null,null,"Impression sur pages A4 100% en format horizontal"]
["  Résultats détaillés par ARTICLE de l'autodiagnostic selon la norme ISO 9001:2015"]
[]
[]
[null,{"$f":"Exigences!A5","v":"Art. 4"},{"$f":"Exigences!D5","v":"Contexte de l'organisme"}]
[null,"Niveau d'évaluation"," Taux de CONFORMITÉ aux critères d'exigence",null,null,"COMMENTAIRES sur les RÉSULTATS obtenus"]
[null,{"$f":"'Résultats globaux'!E30","v":"Insuffisant"},{"$f":"'Résultats globaux'!G30","v":0},null,null,"Commentaires (collectifs si possible)  :"]
[null,null,null,null,null,"DÉCISIONS : Plans d'action PRIORITAIRES"]
[null,null,null,null,null,"QUOI\nObjectifs à atteindre","QUI\nen Interne ou en Externe","QUAND ET OÙ\nDate et Champ d'application"]
[null,null,null,null,null,"Plan n°1 :"]
[null,null,null,null,null,"Plan n°2 :"]
[null,null,null,null,null,"   Plan n°3 :"]
[]
[null,{"$f":"Exigences!A27","v":"Art. 5"},{"$f":"Exigences!D27","v":"Leadership"}]
[null,"Niveau d'évaluation"," Taux de CONFORMITÉ aux critères d'exigence",null,null,"COMMENTAIRES sur les RÉSULTATS obtenus"]
{"$rows_left_out":52}
{"sheet":"Conseils","index":4,"n_rows":40,"n_cols":5,"rows_kept":40,"cut":false,"hidden":false,"merged":[[37,3,39,3],[10,0,10,4],[36,0,36,4],[37,4,39,4],[6,4,9,4],[11,4,13,4],[15,4,17,4],[19,4,23,4],[25,4,31,4],[0,0,0,4],[1,0,1,4],[33,4,35,4],[5,0,5,4],[14,0,14,4],[18,0,18,4],[24,0,24,4],[32,0,32,4],[3,0,3,2],[6,3,9,3],[11,3,13,3],[15,3,17,3],[19,3,23,3],[25,3,31,3],[33,3,35,3]]}
["   Autodiagnostic selon la norme ISO 9001:2015"]
["\"Systèmes de management de la qualité - Exigences\", édition  Afnor, www.afnor.org, octobre 2015"]
[]
[null,null,null,"Quelques CONSEILS pour atteindre le respect des exigences..."]
[null,null,"Articles","Quoi","Qui"]
["Art. 4    Contexte de l'organisme"]
[null,"4.1","Compréhension de l'organisme et de son contexte","L’organisme doit déterminer les enjeux externes et internes liés au contexte socio-économique dans lequel il se situe. De plus, les parties intéressées doivent être identifiées ainsi que leurs attentes et exigences. Ces dernières seront listées et revus périodiquement. Les champs d'application du système de management de la qualité (SMQ) sont fixés, ainsi que l'ensemble des processus nécessaires à la mise en oeuvre de ce système.","Responsable Qualité et Direction Générale"]
[null,"4.2","Compréhension des besoins et des attentes des parties intéressées"]
[null,"4.3","Détermination du domaine d'application du SMQ"]
[null,"4.4","Système de Management de la Qualité et ses processus"]
["Art. 5    Leadership"]
[null,"5.1","Leadership et engagement","Dans cet article, la responsabilité de la direction est de communiquer et mettre à disposition sa politique qualité qu'elle appliquera et mettra à jour par la suite. L'engagement de la direction consiste aussi à attribuer les responsabilités et les autorités au sein de l'organisme afin d'appliquer sa politique qualité.","Responsable Qualité et Direction Générale"]
[null,"5.2","Politique "]
[null,"5.3","Rôles, responsabilités et autorités au sein de l'organisme"]
["Art. 6    Planification "]
{"$rows_left_out":26}
{"sheet":"Plans d'action détaillés","index":5,"n_rows":50,"n_cols":14,"rows_kept":50,"cut":false,"hidden":false,"merged":[[44,0,45,0],[46,0,47,0],[48,0,49,0],[30,0,31,0],[33,0,34,0],[35,0,36,0],[37,0,38,0],[39,0,40,0],[42,0,43,0],[0,0,0,13],[28,0,29,0],[2,9,2,12],[5,0,6,0],[7,0,8,0],[9,0,10,0],[11,0,12,0],[14,0,15,0],[16,0,17,0],[18,0,19,0],[20,0,21,0],[24,0,25,0],[26,0,27,0]]}
["  Autodiagnostic sur les exigences de l'ISO 9001:2015"]
[]
[null,null,{"$f":"COUNTBLANK(C6:C13)+COUNTBLANK(C15:C22)+COUNTBLANK(C25:C32)+COUNTBLANK(C34:C41)+COUNTBLANK(C43:C50)","v":40},null,null,null,null,null,null,"AVANCEMENT"]
["Désignation du Problème","N°","Action","Pilote","Moyens","Gain Estimé","Gain Réalisé","Debut (semaine)","Durée  (semaine)",0.25,0.5,0.75,1,"Commentaires"]
["ZONE / Processus…."]
[null,1,null,null,null,null,null,null,null,1,1,1,1," "]
[null,2,null,null,null,null,null,null,null,1,0,null,null," "]
[null,1,null,null,null,null,null,null,null,1,1,1,1," "]
[null,2,null,null,null,null,null,null,null,null,null,null,null," "]
[null,1,null,null,null,null,null,null,null,1,1,1,1]
[null,2,null," ",null,null,null,null,null,1,1,1,1," "]
[null,1]
[null,2]
["ZONE / Processus…."]
[null,1,null,null,null,null,null,null,null,1,1,1,1," "]
{"$rows_left_out":36}
{"sheet":"Déclaration ISO 17050","index":6,"n_rows":37,"n_cols":6,"rows_kept":37,"cut":false,"hidden":false,"merged":[[1,0,1,5],[2,0,2,5],[3,0,3,2],[3,3,3,5],[4,0,4,2],[4,3,4,5],[6,0,6,5],[7,0,7,5],[8,0,8,5],[9,0,9,5],[10,0,10,3],[11,0,11,3],[20,0,20,5],[21,0,21,5],[22,0,22,2],[22,3,22,5],[23,0,23,2],[23,3,23,5],[24,0,24,2],[24,3,24,5],[26,0,26,5],[28,0,28,2],[28,3,28,5],[30,0,30,2],[30,3,30,5],[35,0,35,2],[31,0,31,2],[31,3,31,5],[32,0,32,2],[32,3,32,5],[33,0,33,2],[33,3,33,4]]}
[" Fiche de déclaration de conformité par une première partie - norme ISO 17050",null,null,null,null,"Enregistrement qualité : impression sur 1 page A4 100% en vertical"]
["Déclaration de conformité selon la norme NF EN ISO 17050 Partie 1 : Exigences générales"]
["Évaluation de la conformité - Déclaration de conformité du fournisseur (NF EN ISO/CEI 17050-1)"]
["Date limite de validité de la déclaration :",null,null,"Référence unique de la déclaration ISO 17050 :"]
[{"$f":"IFERROR(A36+364,\"Date de la déclaration + 1 an\")","v":"Date de la déclaration + 1 an"},null,null,{"$f":"IF(A36=\"\",\"remplir la cellule de date de la déclaration (onglet ISO 17050)\",IF(ISERROR(YEAR(A36)),\"date de la déclaration invalide\",CONCATENATE(\"Autodeclaration_ISO_17050_sur_la_NF_S99-170_en_\",YEAR(A36),\"_\",MONTH(A36),\"_\",DAY(A36))))","v":"date de la déclaration invalide"}]
[]
["Objet de la déclaration : Niveau de CONFORMITÉ aux EXIGENCES de la norme NF EN ISO 9001:2015"]
["Mode Emploi!"]
["Nous soussigés, déclarons sous notre propre responsabilité que les niveaux de conformité de nos pratiques professionnelles ont été mesurés d'après les exigences de la norme NF EN ISO 9001:2015."]
["Nous avons appliqué la meilleure rigueur d'élaboration et d'analyse (évaluation par plusieurs personnes compétentes) et nous avons respecté les règles d'éthique professionnelle (absence de conflits d'intérêt, respect des opinions, liberté des choix) pour parvenir aux résultats ci-dessous."]
["Tableau des résultats de CONFORMITÉ de nos activités \nselon les critères d'exigence tirés de la norme NF EN ISO 9001:2015",null,null,null,"Taux moyen","Niveaux de Conformité"]
[{"$f":"'Résultats globaux'!B29","v":"Niveau moyen sur l'ensemble des articles de la norme ISO 9001:2015 :"},null,null,null,{"$f":"'Résultats globaux'!G29","v":0},{"$f":"IF('Résultats globaux'!$E$29='Mode Emploi'!$H$17,'Résultats globaux'!$E$29,\"Non déclarable\")","v":"Non déclarable"}]
[{"$f":"'Résultats globaux'!A30","v":"Art. 4"},{"$f":"Exigences!D5","v":"Contexte de l'organisme"},null,null,{"$f":"'Résultats globaux'!G30","v":0},{"$f":"IF('Résultats globaux'!E30='Mode Emploi'!$H$17,'Résultats globaux'!E30,\"Non déclarable\")","v":"Non déclarable"}]
[{"$f":"'Résultats globaux'!A35","v":"Art. 5"},{"$f":"Exigences!D27","v":"Leadership"},null,null,{"$f":"'Résultats globaux'!G35","v":0},{"$f":"IF('Résultats globaux'!E35='Mode Emploi'!$H$17,'Résultats globaux'!E35,\"Non déclarable\")","v":"Non déclarable"}]
[{"$f":"'Résultats globaux'!A39","v":"Art. 6"},{"$f":"Exigences!D42","v":"Planification"},null,null,{"$f":"'Résultats globaux'!G39","v":0},{"$f":"IF('Résultats globaux'!E39='Mode Emploi'!$H$17,'Résultats globaux'!E39,\"Non déclarable\")","v":"Non déclarable"}]
{"$rows_left_out":22}