{"text_format":"1","workbook":"xlsx","n_sheets":10,"sheets":["Home","User Manual","Hoja7","J -Gap Analysis","U -Tracking","Hoja2","M - Matrix","M-Self-assessment","P - Action Plan","Charts"],"not_rendered":{"charts":4,"images":7,"macros":1,"external_links":0,"defined_names":12,"comments":0,"pivot_tables":0},"unopened":[],"bounds":{"document_bytes":16777216,"sheet_cells":100000,"rows_first":2000,"rows_last":500,"rows_between":2000,"halvings":0,"cell_chars":16384,"cell_head_chars":4096},"cells_cut":0,"cells_raw":0,"read":"whole","date_system":"1900"}

{"sheet":"Home","index":0,"n_rows":5,"n_cols":12,"rows_kept":5,"cut":false,"hidden":false,"merged":[[4,1,20,5],[3,11,3,13],[33,10,40,12]]}
[]
[]
[]
[null,null,null,null,null,null,null,null,null,null,null,"JUMP METHODOLOGY"]
[null,"JUMP toolbox"]

{"sheet":"User Manual","index":1,"n_rows":30,"n_cols":7,"rows_kept":30,"cut":false,"hidden":false,"merged":[[23,1,24,1],[26,2,26,5],[27,2,27,5],[4,1,4,7],[0,5,2,7],[11,1,11,7],[13,1,13,2],[14,1,14,7],[15,1,15,7],[16,1,16,7],[17,1,17,7],[18,1,18,7],[19,1,19,7],[12,1,12,7],[28,2,28,5],[29,2,29,5],[21,2,21,5],[23,6,24,7],[25,6,25,7],[26,6,26,7],[27,6,27,7],[28,6,28,7],[29,6,29,7],[23,2,24,5],[25,2,25,5]]}
[null,null,null,null,null,"Designer of the JUMP toolbox: gmmorenor91@gmail.com\nPrinting on A4 pages 100% in horizontal format"]
[]
[]
[]
[null,"User Guide for the JUMPToolbox"]
[]
[null,"Entreprise:"]
[null,"Responsible for the QMS:"]
[null,"QMS Contact:"]
[]
[null,"GOAL:"]
[null,"This toolbox helps the different users to implement  JUMP methodoloy for a succesful IATF 16949: 2016 and to  guarantee conformity of the quality management system. It proposes 4 tools that support the JUMP methodology. "]
[null,"To learn more, follow this link, this video describes how JUMP toolbox works"]
[null,"Instructions"]
[null,"1. Follow the  steps of the JUMP methodology to use the tools"]
{"$rows_left_out":16}
{"sheet":"Hoja7","index":2,"n_rows":14,"n_cols":15,"rows_kept":14,"cut":false,"hidden":true,"merged":[]}
[]
[]
[null,null,null,null,null,null,null,null,null,null,"A","L",null,"L1","A12"]
[null,null,null,null,"Started",null,"Simple",null,"To modify",null,"Insufficient",{"$f":"'User Manual'!G26","v":0.2},null,0,"Insufficient"]
[null,null,null,null,"Ongoing",null,"Intermediate",null,"Initial draft Created",null,"Informal",{"$f":"'User Manual'!G27","v":0.4},null,0.1,"Insufficient"]
[null,null,null,null,"Completed",null,"Difficult",null,"In review",null,"Efficient",{"$f":"'User Manual'!G28","v":0.6},null,0.2,"Insufficient"]
[null,null,null,null,null,null,null,null,"In feedback process",null,"Effective",{"$f":"'User Manual'!G29","v":0.8},null,0.3,"Informal"]
[null,null,null,null,null,null,null,null,"Final review",null,"High-performance",{"$f":"'User Manual'!G30","v":1},null,0.4,"Informal"]
[null,null,null,null,null,null,null,null,"Validated",null,null,null,null,0.5,"Efficient"]
[null,null,null,null,null,null,null,null,"Approved",null,null,null,null,0.6,"Efficient"]
[null,null,null,null,null,null,null,null,"Communicated",null,null,null,null,0.7,"Effective"]
[null,null,null,null,null,null,null,null,null,null,null,null,null,0.8,"Effective"]
[null,null,null,null,null,null,null,null,null,null,null,null,null,0.9,"High-performance"]
[null,null,null,null,null,null,null,null,null,null,null,null,null,1,"High-performance"]

{"sheet":"J -Gap Analysis","index":3,"n_rows":540,"n_cols":13,"rows_kept":540,"cut":false,"hidden":false,"merged":[[0,8,3,12],[1,3,3,7]]}
[null,null,null,null,null,null,null,null,"Designer of the JUMP toolbox: gmmorenor91@gmail.com\nPrinting on A4 pages 100% in horizontal format"]
[null,null,null,"GAP ANALYSIS IATF 16949: 2016"]
[]
[]
[]
[null,"Chapter","Item","status","Requirement","ISO/TS 16949 correlation","Process concerned","Related documents","Implementation level","Commplexity level","Action to close gap","Leader","Deadline"]
[null,"4. Context of the organization","4.1Understanding the organization and its context","New","4.1","4         Quality management system\n5.6     Management review\n","Strategy"]
[null,"4. Context of the organization","4.2 Understanding the needs and expectations of interested parties",null,"4.2a","4         Quality management system\n5.6     Management review\n","Quality"]
[null,"4. Context of the organization","4.2 Understanding the needs and expectations of interested parties",null,"4.2b","4         Quality management system\n5.6     Management review\n","Quality"]
[null,"4. Context of the organization","4.3 Determining the scope of the quality management system",null,"4.3 a","1.2      Application\n4.2.2  Quality manual\n","Quality"]
[null,"4. Context of the organization","4.3 Determining the scope of the quality management system",null,"4.3b","1.2      Application\n4.2.2  Quality manual\n","Quality"]
[null,"4. Context of the organization","4.3 Determining the scope of the quality management system",null,"4.3c","1.2      Application\n4.2.2  Quality manual\n","Quality"]
[null,"4. Context of the organization","4.3.1. Determining the scope of the quality management system — supplementa",null,"4.3.1","1.1      General\n1.2      Application\n","Quality"]
[null,"4. Context of the organization","4.3.2. Customer-specific requirements","New","4.3.2","No equivalent clause","Quality"]
[null,"4. Context of the organization","4.4.1 QMS and its processes\n",null,"4.4.1a","4         Quality management system\n4.1      General requirements\n","Quality"]
{"$rows_left_out":526}
{"sheet":"U -Tracking","index":4,"n_rows":14,"n_cols":9,"rows_kept":14,"cut":false,"hidden":false,"merged":[[0,6,3,8],[1,2,2,4]]}
[null,null,null,null,null,null,"Designer of the JUMP toolbox: gmmorenor91@gmail.com\nPrinting on A4 pages 100% in horizontal format"]
[null,null,"TRACKING"]
[]
[]
[]
[null,"Process","Reference number","Name","Last publication date","Modifications to do","Modification start date","Deadline to update","Status"]
[null,"Strategy","0001","Document's name 0001","2016-01-12","Details","2017-02-01","2017-02-16","Communicated"]
[null,"Logistic","0002","Document's name 0002","2016-01-13","Details","2017-02-02","2017-02-17","Approved"]
[null,"Purchasing","0003","Document's name 0003","2016-01-14","Details","2017-02-07","2017-02-18","Validated"]
[null,"Human Resources","0004","Document's name 0004","2016-01-15","Details","2017-02-08","2017-02-20","Final review"]
[null,"Strategy","0005","Document's name 0005","2016-01-16","Details","2017-02-09","2017-02-22","In feedback process"]
[null,"Purchasing","0006","Document's name 0006","2016-01-17","Details","2017-02-08","2017-02-25","In review"]
[null,"Quality","0007","Document's name 0007","2016-01-18","Details","2017-02-11","2017-03-01","Initial draft Created"]
[null,"Quality","0008","Document's name 0008","2016-02-12","Details","2017-03-01","2017-03-19","To modify"]

{"sheet":"Hoja2","index":5,"n_rows":73,"n_cols":14,"rows_kept":73,"cut":false,"hidden":true,"merged":[]}
[]
[]
[null,null,"Reference number","Modification start date","Duration","Deadline to update","% Progress","Progress on days","Remaining days",null,null,null,"Status","%"]
[null,null,{"$f":"'U -Tracking'!C7","v":"0001"},{"$f":"('U -Tracking'!G7)","v":"2017-02-01"},{"$f":"F4-D4","v":15},{"$f":"('U -Tracking'!H7)","v":"2017-02-16"},{"$f":"VLOOKUP('U -Tracking'!I7,Hoja2!$M$4:$N$11,2,FALSE)","v":1},{"$f":"E4*G4","v":15},{"$f":"E4-H4","v":0},null,null,null,"To modify",0]
[null,null,{"$f":"'U -Tracking'!C8","v":"0002"},{"$f":"('U -Tracking'!G8)","v":"2017-02-02"},{"$f":"F5-D5","v":15},{"$f":"('U -Tracking'!H8)","v":"2017-02-17"},{"$f":"VLOOKUP('U -Tracking'!I8,Hoja2!$M$4:$N$11,2,FALSE)","v":0.9},{"$f":"E5*G5","v":13.5},{"$f":"E5-H5","v":1.5},null,null,null,"Initial draft Created",0.3]
[null,null,{"$f":"'U -Tracking'!C9","v":"0003"},{"$f":"('U -Tracking'!G9)","v":"2017-02-07"},11,{"$f":"('U -Tracking'!H9)","v":"2017-02-18"},{"$f":"VLOOKUP('U -Tracking'!I9,Hoja2!$M$4:$N$11,2,FALSE)","v":0.8},8.8000000000000007,2.1999999999999993,null,null,null,"In review",0.4]
[null,null,{"$f":"'U -Tracking'!C10","v":"0004"},{"$f":"('U -Tracking'!G10)","v":"2017-02-08"},12,{"$f":"('U -Tracking'!H10)","v":"2017-02-20"},{"$f":"VLOOKUP('U -Tracking'!I10,Hoja2!$M$4:$N$11,2,FALSE)","v":0.7},8.3999999999999986,3.6000000000000014,null,null,null,"In feedback process",0.5]
[null,null,{"$f":"'U -Tracking'!C11","v":"0005"},{"$f":"('U -Tracking'!G11)","v":"2017-02-09"},13,{"$f":"('U -Tracking'!H11)","v":"2017-02-22"},{"$f":"VLOOKUP('U -Tracking'!I11,Hoja2!$M$4:$N$11,2,FALSE)","v":0.5},6.5,6.5,null,null,null,"Final review",0.7]
[null,null,{"$f":"'U -Tracking'!C12","v":"0006"},{"$f":"('U -Tracking'!G12)","v":"2017-02-08"},17,{"$f":"('U -Tracking'!H12)","v":"2017-02-25"},{"$f":"VLOOKUP('U -Tracking'!I12,Hoja2!$M$4:$N$11,2,FALSE)","v":0.4},6.8000000000000007,10.199999999999999,null,null,null,"Validated",0.8]
[null,null,{"$f":"'U -Tracking'!C13","v":"0007"},{"$f":"('U -Tracking'!G13)","v":"2017-02-11"},18,{"$f":"('U -Tracking'!H13)","v":"2017-03-01"},{"$f":"VLOOKUP('U -Tracking'!I13,Hoja2!$M$4:$N$11,2,FALSE)","v":0.3},5.3999999999999995,12.600000000000001,null,null,null,"Approved",0.9]
[null,null,{"$f":"'U -Tracking'!C14","v":"0008"},{"$f":"('U -Tracking'!G14)","v":"2017-03-01"},18,{"$f":"('U -Tracking'!H14)","v":"2017-03-19"},{"$f":"VLOOKUP('U -Tracking'!I14,Hoja2!$M$4:$N$11,2,FALSE)","v":0},0,18,null,null,null,"Communicated",1]
[null,null,{"$f":"'U -Tracking'!C15","v":0},{"$f":"('U -Tracking'!G15)","v":"00:00:00"},0,{"$f":"('U -Tracking'!H15)","v":"00:00:00"},{"$f":"VLOOKUP('U -Tracking'!I15,Hoja2!$M$4:$N$11,2,FALSE)","v":{"$error":"#N/A"}},{"$error":"#N/A"},{"$error":"#N/A"}]
[null,null,{"$f":"'U -Tracking'!C16","v":0},{"$f":"('U -Tracking'!G16)","v":"00:00:00"},0,{"$f":"('U -Tracking'!H16)","v":"00:00:00"},{"$f":"VLOOKUP('U -Tracking'!I16,Hoja2!$M$4:$N$11,2,FALSE)","v":{"$error":"#N/A"}},{"$error":"#N/A"},{"$error":"#N/A"}]
[null,null,{"$f":"'U -Tracking'!C17","v":0},{"$f":"('U -Tracking'!G17)","v":"00:00:00"},0,{"$f":"('U -Tracking'!H17)","v":"00:00:00"},{"$f":"VLOOKUP('U -Tracking'!I17,Hoja2!$M$4:$N$11,2,FALSE)","v":{"$error":"#N/A"}},{"$error":"#N/A"},{"$error":"#N/A"}]
[null,null,{"$f":"'U -Tracking'!C18","v":0},{"$f":"('U -Tracking'!G18)","v":"00:00:00"},0,{"$f":"('U -Tracking'!H18)","v":"00:00:00"},{"$f":"VLOOKUP('U -Tracking'!I18,Hoja2!$M$4:$N$11,2,FALSE)","v":{"$error":"#N/A"}},{"$error":"#N/A"},{"$error":"#N/A"}]
{"$rows_left_out":59}
{"sheet":"M - Matrix","index":6,"n_rows":539,"n_cols":12,"rows_kept":539,"cut":false,"hidden":false,"merged":[[0,9,3,11],[1,4,2,7]]}
[null,null,null,null,null,null,null,null,null,"Designer of the JUMP toolbox: gmmorenor91@gmail.com\nPrinting on A4 pages 100% in horizontal format"]
[null,null,null,null,"MATRIX"]
[]
[]
[null,null,"Requirement",{"$f":"'M-Self-assessment'!D16","v":"Production"},{"$f":"'M-Self-assessment'!D17","v":"Quality"},{"$f":"'M-Self-assessment'!D18","v":"Finance"},{"$f":"'M-Self-assessment'!D19","v":"Strategy"},{"$f":"'M-Self-assessment'!D20","v":"Logistic"},{"$f":"'M-Self-assessment'!D21","v":"Purchasing"},{"$f":"'M-Self-assessment'!D22","v":"Human Resources"},{"$f":"'M-Self-assessment'!D23","v":"Design, Research and Development"},{"$f":"'M-Self-assessment'!D24","v":"Marketing and Sales"}]
[null,null,{"$f":"'J -Gap Analysis'!E7","v":"4.1"},{"$f":"IF('J -Gap Analysis'!$G$7='M - Matrix'!D5,'J -Gap Analysis'!$H$7,\"NA\")","v":"NA"},{"$f":"IF('J -Gap Analysis'!G7='M - Matrix'!$E$5,'J -Gap Analysis'!H7,\"NA\")","v":"NA"},{"$f":"IF('J -Gap Analysis'!G7='M - Matrix'!$F$5,'J -Gap Analysis'!H7,\"NA\")","v":"NA"},{"$f":"IF('J -Gap Analysis'!G7='M - Matrix'!$G$5,'J -Gap Analysis'!H7,\"NA\")","v":0},{"$f":"IF('J -Gap Analysis'!G7='M - Matrix'!$H$5,'J -Gap Analysis'!H7,\"NA\")","v":"NA"},{"$f":"IF('J -Gap Analysis'!G7='M - Matrix'!$I$5,'J -Gap Analysis'!H7,\"NA\")","v":"NA"},{"$f":"IF('J -Gap Analysis'!G7='M - Matrix'!$J$5,'J -Gap Analysis'!H7,\"NA\")","v":"NA"},{"$f":"IF('J -Gap Analysis'!G7='M - Matrix'!$K$5,'J -Gap Analysis'!H7,\"NA\")","v":"NA"},{"$f":"IF('J -Gap Analysis'!G7='M - Matrix'!$L$5,'J -Gap Analysis'!H7,\"NA\")","v":"NA"}]
[null,null,{"$f":"'J -Gap Analysis'!E8","v":"4.2a"},{"$f":"IF('J -Gap Analysis'!G8='M - Matrix'!$D$5,'J -Gap Analysis'!H8,\"NA\")","v":"NA"},{"$f":"IF('J -Gap Analysis'!G8='M - Matrix'!$E$5,'J -Gap Analysis'!H8,\"NA\")","v":0},{"$f":"IF('J -Gap Analysis'!G8='M - Matrix'!$F$5,'J -Gap Analysis'!H8,\"NA\")","v":"NA"},{"$f":"IF('J -Gap Analysis'!G8='M - Matrix'!$G$5,'J -Gap Analysis'!H8,\"NA\")","v":"NA"},{"$f":"IF('J -Gap Analysis'!G8='M - Matrix'!$H$5,'J -Gap Analysis'!H8,\"NA\")","v":"NA"},{"$f":"IF('J -Gap Analysis'!G8='M - Matrix'!$I$5,'J -Gap Analysis'!H8,\"NA\")","v":"NA"},{"$f":"IF('J -Gap Analysis'!G8='M - Matrix'!$J$5,'J -Gap Analysis'!H8,\"NA\")","v":"NA"},{"$f":"IF('J -Gap Analysis'!G8='M - Matrix'!$K$5,'J -Gap Analysis'!H8,\"NA\")","v":"NA"},{"$f":"IF('J -Gap Analysis'!G8='M - Matrix'!$L$5,'J -Gap Analysis'!H8,\"NA\")","v":"NA"}]
[null,null,{"$f":"'J -Gap Analysis'!E9","v":"4.2b"},{"$f":"IF('J -Gap Analysis'!G9='M - Matrix'!$D$5,'J -Gap Analysis'!H9,\"NA\")","v":"NA"},{"$f":"IF('J -Gap Analysis'!G9='M - Matrix'!$E$5,'J -Gap Analysis'!H9,\"NA\")","v":0},{"$f":"IF('J -Gap Analysis'!G9='M - Matrix'!$F$5,'J -Gap Analysis'!H9,\"NA\")","v":"NA"},{"$f":"IF('J -Gap Analysis'!G9='M - Matrix'!$G$5,'J -Gap Analysis'!H9,\"NA\")","v":"NA"},{"$f":"IF('J -Gap Analysis'!G9='M - Matrix'!$H$5,'J -Gap Analysis'!H9,\"NA\")","v":"NA"},{"$f":"IF('J -Gap Analysis'!G9='M - Matrix'!$I$5,'J -Gap Analysis'!H9,\"NA\")","v":"NA"},{"$f":"IF('J -Gap Analysis'!G9='M - Matrix'!$J$5,'J -Gap Analysis'!H9,\"NA\")","v":"NA"},{"$f":"IF('J -Gap Analysis'!G9='M - Matrix'!$K$5,'J -Gap Analysis'!H9,\"NA\")","v":"NA"},{"$f":"IF('J -Gap Analysis'!G9='M - Matrix'!$L$5,'J -Gap Analysis'!H9,\"NA\")","v":"NA"}]
[null,null,{"$f":"'J -Gap Analysis'!E10","v":"4.3 a"},{"$f":"IF('J -Gap Analysis'!G10='M - Matrix'!$D$5,'J -Gap Analysis'!H10,\"NA\")","v":"NA"},{"$f":"IF('J -Gap Analysis'!G10='M - Matrix'!$E$5,'J -Gap Analysis'!H10,\"NA\")","v":0},{"$f":"IF('J -Gap Analysis'!G10='M - Matrix'!$F$5,'J -Gap Analysis'!H10,\"NA\")","v":"NA"},{"$f":"IF('J -Gap Analysis'!G10='M - Matrix'!$G$5,'J -Gap Analysis'!H10,\"NA\")","v":"NA"},{"$f":"IF('J -Gap Analysis'!G10='M - Matrix'!$H$5,'J -Gap Analysis'!H10,\"NA\")","v":"NA"},{"$f":"IF('J -Gap Analysis'!G10='M - Matrix'!$I$5,'J -Gap Analysis'!H10,\"NA\")","v":"NA"},{"$f":"IF('J -Gap Analysis'!G10='M - Matrix'!$J$5,'J -Gap Analysis'!H10,\"NA\")","v":"NA"},{"$f":"IF('J -Gap Analysis'!G10='M - Matrix'!$K$5,'J -Gap Analysis'!H10,\"NA\")","v":"NA"},{"$f":"IF('J -Gap Analysis'!G10='M - Matrix'!$L$5,'J -Gap Analysis'!H10,\"NA\")","v":"NA"}]
[null,null,{"$f":"'J -Gap Analysis'!E11","v":"4.3b"},{"$f":"IF('J -Gap Analysis'!G11='M - Matrix'!$D$5,'J -Gap Analysis'!H11,\"NA\")","v":"NA"},{"$f":"IF('J -Gap Analysis'!G11='M - Matrix'!$E$5,'J -Gap Analysis'!H11,\"NA\")","v":0},{"$f":"IF('J -Gap Analysis'!G11='M - Matrix'!$F$5,'J -Gap Analysis'!H11,\"NA\")","v":"NA"},{"$f":"IF('J -Gap Analysis'!G11='M - Matrix'!$G$5,'J -Gap Analysis'!H11,\"NA\")","v":"NA"},{"$f":"IF('J -Gap Analysis'!G11='M - Matrix'!$H$5,'J -Gap Analysis'!H11,\"NA\")","v":"NA"},{"$f":"IF('J -Gap Analysis'!G11='M - Matrix'!$I$5,'J -Gap Analysis'!H11,\"NA\")","v":"NA"},{"$f":"IF('J -Gap Analysis'!G11='M - Matrix'!$J$5,'J -Gap Analysis'!H11,\"NA\")","v":"NA"},{"$f":"IF('J -Gap Analysis'!G11='M - Matrix'!$K$5,'J -Gap Analysis'!H11,\"NA\")","v":"NA"},{"$f":"IF('J -Gap Analysis'!G11='M - Matrix'!$L$5,'J -Gap Analysis'!H11,\"NA\")","v":"NA"}]
[null,null,{"$f":"'J -Gap Analysis'!E12","v":"4.3c"},{"$f":"IF('J -Gap Analysis'!G12='M - Matrix'!$D$5,'J -Gap Analysis'!H12,\"NA\")","v":"NA"},{"$f":"IF('J -Gap Analysis'!G12='M - Matrix'!$E$5,'J -Gap Analysis'!H12,\"NA\")","v":0},{"$f":"IF('J -Gap Analysis'!G12='M - Matrix'!$F$5,'J -Gap Analysis'!H12,\"NA\")","v":"NA"},{"$f":"IF('J -Gap Analysis'!G12='M - Matrix'!$G$5,'J -Gap Analysis'!H12,\"NA\")","v":"NA"},{"$f":"IF('J -Gap Analysis'!G12='M - Matrix'!$H$5,'J -Gap Analysis'!H12,\"NA\")","v":"NA"},{"$f":"IF('J -Gap Analysis'!G12='M - Matrix'!$I$5,'J -Gap Analysis'!H12,\"NA\")","v":"NA"},{"$f":"IF('J -Gap Analysis'!G12='M - Matrix'!$J$5,'J -Gap Analysis'!H12,\"NA\")","v":"NA"},{"$f":"IF('J -Gap Analysis'!G12='M - Matrix'!$K$5,'J -Gap Analysis'!H12,\"NA\")","v":"NA"},{"$f":"IF('J -Gap Analysis'!G12='M - Matrix'!$L$5,'J -Gap Analysis'!H12,\"NA\")","v":"NA"}]
[null,null,{"$f":"'J -Gap Analysis'!E13","v":"4.3.1"},{"$f":"IF('J -Gap Analysis'!G13='M - Matrix'!$D$5,'J -Gap Analysis'!H13,\"NA\")","v":"NA"},{"$f":"IF('J -Gap Analysis'!G13='M - Matrix'!$E$5,'J -Gap Analysis'!H13,\"NA\")","v":0},{"$f":"IF('J -Gap Analysis'!G13='M - Matrix'!$F$5,'J -Gap Analysis'!H13,\"NA\")","v":"NA"},{"$f":"IF('J -Gap Analysis'!G13='M - Matrix'!$G$5,'J -Gap Analysis'!H13,\"NA\")","v":"NA"},{"$f":"IF('J -Gap Analysis'!G13='M - Matrix'!$H$5,'J -Gap Analysis'!H13,\"NA\")","v":"NA"},{"$f":"IF('J -Gap Analysis'!G13='M - Matrix'!$I$5,'J -Gap Analysis'!H13,\"NA\")","v":"NA"},{"$f":"IF('J -Gap Analysis'!G13='M - Matrix'!$J$5,'J -Gap Analysis'!H13,\"NA\")","v":"NA"},{"$f":"IF('J -Gap Analysis'!G13='M - Matrix'!$K$5,'J -Gap Analysis'!H13,\"NA\")","v":"NA"},{"$f":"IF('J -Gap Analysis'!G13='M - Matrix'!$L$5,'J -Gap Analysis'!H13,\"NA\")","v":"NA"}]
[null,null,{"$f":"'J -Gap Analysis'!E14","v":"4.3.2"},{"$f":"IF('J -Gap Analysis'!G14='M - Matrix'!$D$5,'J -Gap Analysis'!H14,\"NA\")","v":"NA"},{"$f":"IF('J -Gap Analysis'!G14='M - Matrix'!$E$5,'J -Gap Analysis'!H14,\"NA\")","v":0},{"$f":"IF('J -Gap Analysis'!G14='M - Matrix'!$F$5,'J -Gap Analysis'!H14,\"NA\")","v":"NA"},{"$f":"IF('J -Gap Analysis'!G14='M - Matrix'!$G$5,'J -Gap Analysis'!H14,\"NA\")","v":"NA"},{"$f":"IF('J -Gap Analysis'!G14='M - Matrix'!$H$5,'J -Gap Analysis'!H14,\"NA\")","v":"NA"},{"$f":"IF('J -Gap Analysis'!G14='M - Matrix'!$I$5,'J -Gap Analysis'!H14,\"NA\")","v":"NA"},{"$f":"IF('J -Gap Analysis'!G14='M - Matrix'!$J$5,'J -Gap Analysis'!H14,\"NA\")","v":"NA"},{"$f":"IF('J -Gap Analysis'!G14='M - Matrix'!$K$5,'J -Gap Analysis'!H14,\"NA\")","v":"NA"},{"$f":"IF('J -Gap Analysis'!G14='M - Matrix'!$L$5,'J -Gap Analysis'!H14,\"NA\")","v":"NA"}]
[null,null,{"$f":"'J -Gap Analysis'!E15","v":"4.4.1a"},{"$f":"IF('J -Gap Analysis'!G15='M - Matrix'!$D$5,'J -Gap Analysis'!H15,\"NA\")","v":"NA"},{"$f":"IF('J -Gap Analysis'!G15='M - Matrix'!$E$5,'J -Gap Analysis'!H15,\"NA\")","v":0},{"$f":"IF('J -Gap Analysis'!G15='M - Matrix'!$F$5,'J -Gap Analysis'!H15,\"NA\")","v":"NA"},{"$f":"IF('J -Gap Analysis'!G15='M - Matrix'!$G$5,'J -Gap Analysis'!H15,\"NA\")","v":"NA"},{"$f":"IF('J -Gap Analysis'!G15='M - Matrix'!$H$5,'J -Gap Analysis'!H15,\"NA\")","v":"NA"},{"$f":"IF('J -Gap Analysis'!G15='M - Matrix'!$I$5,'J -Gap Analysis'!H15,\"NA\")","v":"NA"},{"$f":"IF('J -Gap Analysis'!G15='M - Matrix'!$J$5,'J -Gap Analysis'!H15,\"NA\")","v":"NA"},{"$f":"IF('J -Gap Analysis'!G15='M - Matrix'!$K$5,'J -Gap Analysis'!H15,\"NA\")","v":"NA"},{"$f":"IF('J -Gap Analysis'!G15='M - Matrix'!$L$5,'J -Gap Analysis'!H15,\"NA\")","v":"NA"}]
[null,null,{"$f":"'J -Gap Analysis'!E16","v":"4.4.1b"},{"$f":"IF('J -Gap Analysis'!G16='M - Matrix'!$D$5,'J -Gap Analysis'!H16,\"NA\")","v":"NA"},{"$f":"IF('J -Gap Analysis'!G16='M - Matrix'!$E$5,'J -Gap Analysis'!H16,\"NA\")","v":0},{"$f":"IF('J -Gap Analysis'!G16='M - Matrix'!$F$5,'J -Gap Analysis'!H16,\"NA\")","v":"NA"},{"$f":"IF('J -Gap Analysis'!G16='M - Matrix'!$G$5,'J -Gap Analysis'!H16,\"NA\")","v":"NA"},{"$f":"IF('J -Gap Analysis'!G16='M - Matrix'!$H$5,'J -Gap Analysis'!H16,\"NA\")","v":"NA"},{"$f":"IF('J -Gap Analysis'!G16='M - Matrix'!$I$5,'J -Gap Analysis'!H16,\"NA\")","v":"NA"},{"$f":"IF('J -Gap Analysis'!G16='M - Matrix'!$J$5,'J -Gap Analysis'!H16,\"NA\")","v":"NA"},{"$f":"IF('J -Gap Analysis'!G16='M - Matrix'!$K$5,'J -Gap Analysis'!H16,\"NA\")","v":"NA"},{"$f":"IF('J -Gap Analysis'!G16='M - Matrix'!$L$5,'J -Gap Analysis'!H16,\"NA\")","v":"NA"}]
{"$rows_left_out":525}
{"sheet":"M-Self-assessment","index":7,"n_rows":223,"n_cols":13,"rows_kept":223,"cut":false,"hidden":false,"merged":[[11,4,11,6],[4,2,5,12],[0,10,3,12],[7,4,7,6],[8,4,8,6],[9,4,9,6],[10,4,10,6]]}
[null,null,null,null,null,null,null,null,null,null,"Designer of the JUMP toolbox: gmmorenor91@gmail.com\nPrinting on A4 pages 100% in horizontal format"]
[]
[]
[]
[null,null,"SELF-ASSESSMENT "]
[]
[]
[null,null,null,"Entreprise:"]
[null,null,null,"Date:"]
[null,null,null,"Responsible:"]
[null,null,null,"Team:"]
[null,null,null,"Signature of the person responsible for self-assessment:"]
[]
[]
[null,null,null,"Process","Assestment","Level","Comments",null,null,"Process","Assestment","Level","Comments"]
{"$rows_left_out":209}
{"sheet":"P - Action Plan","index":8,"n_rows":15,"n_cols":8,"rows_kept":15,"cut":false,"hidden":false,"merged":[[10,3,10,5],[11,3,11,5],[3,2,4,7],[7,3,7,5],[8,3,8,5],[9,3,9,5]]}
[]
[]
[]
[null,null,"ACTION PLAN"]
[]
[]
[]
[null,null,"Entreprise:"]
[null,null,"Date:"]
[null,null,"Responsible:"]
[null,null,"Team:"]
[null,null,"Signature of the person responsible for self-assessment:"]
[]
[]
[null,null,"Process","Type","Requirement","Action","Responsible","Deadline"]
{"$rows_left_out":1}
{"sheet":"Charts","index":9,"n_rows":14,"n_cols":14,"rows_kept":14,"cut":false,"hidden":false,"merged":[[4,10,4,11],[5,10,5,11],[1,10,1,14],[1,4,1,6],[3,3,4,3],[3,4,4,4],[3,5,4,5],[3,6,4,6]]}
[]
[null,null,null,null,"Advance gap analysis",null,null,null,null,null,"Gantt diagram - Tracking"]
[]
[null,null,null,"Completed requirements","Defined actions","Total progress","Total Requirements"]
[null,null,null,null,null,null,null,null,null,null,"Start date of the Gantt",null,null,{"$f":"MIN('U -Tracking'!G7:G14)","v":42767}]
[null,null,"Production",{"$f":"COUNTIFS('J -Gap Analysis'!$G:$G,Charts!C6,'J -Gap Analysis'!$I:$I,\"Completed\")","v":0},{"$f":"COUNTIFS('J -Gap Analysis'!$G:$G,Charts!C6,'J -Gap Analysis'!$K:$K,\"*\")","v":0},{"$f":"D6+E6","v":0},{"$f":"COUNTIFS('J -Gap Analysis'!$G:$G,Charts!C6)","v":123},{"$f":"IFERROR(F6/G6,0)","v":0},null,null,"End date of the Gantt",null,null,{"$f":"MAX('U -Tracking'!H7:H14)","v":42813}]
[null,null,"Quality",{"$f":"COUNTIFS('J -Gap Analysis'!$G:$G,Charts!C7,'J -Gap Analysis'!$I:$I,\"Completed\")","v":0},{"$f":"COUNTIFS('J -Gap Analysis'!$G:$G,Charts!C7,'J -Gap Analysis'!$K:$K,\"*\")","v":0},{"$f":"D7+E7","v":0},{"$f":"COUNTIFS('J -Gap Analysis'!$G:$G,Charts!C7)","v":166},{"$f":"IFERROR(F7/G7,0)","v":0}]
[null,null,"Finance",{"$f":"COUNTIFS('J -Gap Analysis'!$G:$G,Charts!C8,'J -Gap Analysis'!$I:$I,\"Completed\")","v":0},{"$f":"COUNTIFS('J -Gap Analysis'!$G:$G,Charts!C8,'J -Gap Analysis'!$K:$K,\"*\")","v":0},0,{"$f":"COUNTIFS('J -Gap Analysis'!$G:$G,Charts!C8)","v":11},0]
[null,null,"Strategy",{"$f":"COUNTIFS('J -Gap Analysis'!$G:$G,Charts!C9,'J -Gap Analysis'!$I:$I,\"Completed\")","v":0},{"$f":"COUNTIFS('J -Gap Analysis'!$G:$G,Charts!C9,'J -Gap Analysis'!$K:$K,\"*\")","v":0},0,{"$f":"COUNTIFS('J -Gap Analysis'!$G:$G,Charts!C9)","v":29},0]
[null,null,"Logistic",{"$f":"COUNTIFS('J -Gap Analysis'!$G:$G,Charts!C10,'J -Gap Analysis'!$I:$I,\"Completed\")","v":0},{"$f":"COUNTIFS('J -Gap Analysis'!$G:$G,Charts!C10,'J -Gap Analysis'!$K:$K,\"*\")","v":0},0,{"$f":"COUNTIFS('J -Gap Analysis'!$G:$G,Charts!C10)","v":11},0]
[null,null,"Purchasing",{"$f":"COUNTIFS('J -Gap Analysis'!$G:$G,Charts!C11,'J -Gap Analysis'!$I:$I,\"Completed\")","v":0},{"$f":"COUNTIFS('J -Gap Analysis'!$G:$G,Charts!C11,'J -Gap Analysis'!$K:$K,\"*\")","v":0},0,{"$f":"COUNTIFS('J -Gap Analysis'!$G:$G,Charts!C11)","v":45},0]
[null,null,"Human Resources",{"$f":"COUNTIFS('J -Gap Analysis'!$G:$G,Charts!C12,'J -Gap Analysis'!$I:$I,\"Completed\")","v":0},{"$f":"COUNTIFS('J -Gap Analysis'!$G:$G,Charts!C12,'J -Gap Analysis'!$K:$K,\"*\")","v":0},0,{"$f":"COUNTIFS('J -Gap Analysis'!$G:$G,Charts!C12)","v":29},0]
[null,null,"Design, Research and Development",{"$f":"COUNTIFS('J -Gap Analysis'!$G:$G,Charts!C13,'J -Gap Analysis'!$I:$I,\"Completed\")","v":0},{"$f":"COUNTIFS('J -Gap Analysis'!$G:$G,Charts!C13,'J -Gap Analysis'!$K:$K,\"*\")","v":0},0,{"$f":"COUNTIFS('J -Gap Analysis'!$G:$G,Charts!C13)","v":102},0]
[null,null,"Marketing and Sales",{"$f":"COUNTIFS('J -Gap Analysis'!$G:$G,Charts!C14,'J -Gap Analysis'!$I:$I,\"Completed\")","v":0},{"$f":"COUNTIFS('J -Gap Analysis'!$G:$G,Charts!C14,'J -Gap Analysis'!$K:$K,\"*\")","v":0},0,{"$f":"COUNTIFS('J -Gap Analysis'!$G:$G,Charts!C14)","v":18},0]