{"text_format":"1","workbook":"xlsx","n_sheets":6,"sheets":["INFORMATION","Conseils","Recommandations","Résultats","Détaillé","Déclaration"],"not_rendered":{"charts":8,"images":20,"macros":1,"external_links":0,"defined_names":19,"comments":2,"pivot_tables":0},"unopened":[],"bounds":{"document_bytes":16777216,"sheet_cells":100000,"rows_first":2000,"rows_last":500,"rows_between":2000,"halvings":0,"cell_chars":16384,"cell_head_chars":4096},"cells_cut":0,"cells_raw":0,"read":"whole","date_system":"1900"}

{"sheet":"INFORMATION","index":0,"n_rows":26,"n_cols":14,"rows_kept":26,"cut":false,"hidden":false,"merged":[[12,0,12,3],[1,1,1,8],[2,1,2,8],[4,1,4,8],[3,1,3,8],[23,0,23,1],[18,0,18,1],[5,0,5,8],[11,0,11,8],[17,4,17,8],[7,3,7,8],[8,7,8,8],[17,0,17,3],[7,0,7,2],[8,0,8,2],[8,3,8,6],[13,4,13,8],[6,0,6,2],[6,3,6,8],[9,0,9,2],[9,3,9,8],[23,7,23,8],[13,0,13,3],[12,4,12,8],[14,0,15,3],[25,0,25,8],[19,0,19,1],[18,7,18,8],[19,7,19,8],[24,0,24,8],[22,0,22,1],[21,0,21,1],[20,0,20,1],[20,7,20,8],[21,7,21,8],[22,7,22,8],[16,0,16,2]]}
["Document basé sur la norme NF EN 62198",null,null,null,null,null,null,null,"Enregistrement qualité :  A4 100% vertical"]
[null,"Gestion des risques liés à un projet - Lignes directrices pour l'application"]
[null,"SYSTÈME DE MANAGEMENT DES RISQUES DES PROJETS"]
[null,{"$f":"\"- LA QUALITÉ POUR PERFORMER -\"","v":"- LA QUALITÉ POUR PERFORMER -"}]
[null,"Édition  Afnor\nwww.afnor.org, mai 2014\""]
["Attention : Seules les cases blanches écrites en bleu peuvent être modifiées par l’utilisateur. Cela concerne toutes les parties de l’outil."]
["Etablissement :",null,null,"Nom de l'établissement / entreprise / service..."]
[" Responsable du SMR Projets : ",null,null,"NOM et Prénom du Responsable Qualité"]
[" Contact du Responsable du SMR Projets :",null,null,"Email :",null,null,null,"Tél :"]
["Projet Évalué :",null,null,"Nom du Projet"]
[]
["TABLEAU DE PRÉSENTATION"]
["LETTRE AUX UTILISATEURS",null,null,null,"DESCRIPTION DE L'OUTIL"]
["SMR Projets vous propose une manière facile pour évaluer et lever les incertitudes de vos projets. Il vous est destiné à vous, les responsables de projets, afin de bien contrôler et réaliser vos activités selon la norme NF EN 62198:2014 et ses recommandations. Gratuit, il est simple d'utilisation et applicable à tous types de projets. \n\nCet outil est aussi votre tableau de bord pour suivre, commenter et préparer un plan d'action de votre système de management des risques liés aux projets. De plus, il augmentera votre visibilité afin de minimiser les incertitudes du projet. \n\nL'outil est réalisable à tout moment du projet.\n\nL'équipe SMR Projets vous souhaite un bon travail.",null,null,null,"SMR Projets est un outil sous format Excel constitué de six onglets :\n- INFORMATION : Explique le fonctionnement de l'outil et les critères d'évaluation\n    - RECOMMANDATIONS : Des recommandations extraites de la norme NF EN 62198 pour analyser les processus (pilotage, réalisation et support) du projet\n    - RÉSULTATS GLOBAUX : Vision global des résultats d'état des lieux \n    - RÉSULTATS DÉTAILLÉS : Résumé chiffré et détaillé des recommandations évaluées, ainsi que du plan d'action à mettre en œuvre\n    - CONSEILS : Conaissances documentaires nécessaires et terminologie.\n    - DÉCLARATION : Usage de l'ISO 17050 pour déclarer ses résultats s'ils sont considérés comme probants et communicables",null,null,null,null,null,"\nAttention : Cet outil a été développé avec le système d'exploitation Windows. Si vous l'utilisez dois Mac ou souhaitez l'imprimer, il se peut que la mise en page soit midifiée.  "]
[{"$f":"\" - LA QUALITÉ POUR PERFORMER - \"","v":" - LA QUALITÉ POUR PERFORMER - "},null,null,null," ",null,null,null,null,null,null,null,"Utilitaires pour l'Autodiagnostic"]
{"$rows_left_out":12}
{"sheet":"Conseils","index":1,"n_rows":60,"n_cols":6,"rows_kept":60,"cut":false,"hidden":false,"merged":[[45,1,45,5],[46,1,46,5],[47,1,47,5],[42,1,42,5],[43,1,43,5],[44,1,44,5],[59,0,59,5],[1,0,1,5],[2,0,2,5],[3,0,3,5],[4,0,4,5],[27,1,27,5],[26,1,26,5],[37,1,37,5],[38,1,38,5],[39,1,39,5],[28,1,28,5],[29,1,29,5],[30,1,30,5],[31,1,31,5],[32,1,32,5],[33,1,33,5],[6,0,6,5],[54,1,54,5],[55,1,55,5],[56,1,56,5],[57,1,57,5],[49,1,49,5],[50,1,50,5],[51,1,51,5],[52,1,52,5],[53,1,53,5],[34,1,34,5],[35,1,35,5],[36,1,36,5],[48,1,48,5],[40,1,40,5],[41,1,41,5],[8,0,10,0],[7,1,7,3],[7,4,7,5],[8,1,8,3],[8,4,8,5],[9,1,9,3],[9,4,9,5],[23,4,23,5],[12,0,17,0],[10,1,10,3],[10,4,10,5],[11,1,11,3],[11,4,11,5],[12,1,12,3],[12,4,12,5],[13,1,13,3],[13,4,13,5],[14,1,14,3],[14,4,14,5],[15,1,15,3],[15,4,15,5],[16,1,16,3],[16,4,16,5],[18,0,24,0],[24,1,24,3],[24,4,24,5],[17,1,17,3],[17,4,17,5],[18,1,18,3],[18,4,18,5],[19,1,19,3],[19,4,19,5],[20,1,20,3],[20,4,20,5],[21,1,21,3],[21,4,21,5],[22,1,22,3],[22,4,22,5],[23,1,23,3]]}
["Document basé sur la norme NF EN 62198",null,null,null,null,"Enregistrement qualité :  A4 100% vertical"]
["Gestion des risques liés à un projet - Lignes directrices pour l'application"]
["SYSTÈME DE MANAGEMENT DES RISQUES DES PROJETS"]
[{"$f":"\"- LA QUALITÉ POUR PERFORMER -\"","v":"- LA QUALITÉ POUR PERFORMER -"}]
["Édition  Afnor\nwww.afnor.org, mai 2014\""]
[]
["Système documentaire nécéssaire"]
["Chapître","Informations",null,null,"Remarque"]
["4 - Management","Management du risque dans les projets",null,null,"Vous pouvez commenter"]
[null,"Phases classiques d'un projet",null,null,"Vous pouvez commenter"]
[null,"Principales parties prenantes à un projet",null,null,"Vous pouvez commenter"]
["5 - Principes","Une liste des principes à respecter à tous les niveaux ",null,null,"Vous pouvez commenter"]
["6 - Cadre organisationnel  du management des risques liés à un projet","Généralités : Relations entre les composants, adaptées de l'ISO 31000",null,null,"Vous pouvez commenter"]
[null,"Mandat et engagement",null,null,"Vous pouvez commenter"]
[null,"Conception du cadre organisationnel : Compréhension du projet et de son contexte, Mise en place d'une politique, Responsabilité, Intégration aux processus de gestion de projet, Ressources, Mise en place de mécanismes de communication et de génération de rapport internes et externes sur le projet",null,null,"Vous pouvez commenter"]
{"$rows_left_out":46}
{"sheet":"Recommandations","index":2,"n_rows":72,"n_cols":27,"rows_kept":72,"cut":false,"hidden":false,"merged":[[65,5,65,6],[32,5,32,6],[34,5,34,6],[35,5,35,6],[39,5,39,6],[44,5,44,6],[47,5,47,6],[53,5,53,6],[11,5,11,6],[22,5,22,6],[52,5,52,6],[26,5,26,6],[61,5,61,6],[8,1,8,6],[12,8,14,8],[19,8,20,8],[21,8,22,8],[1,1,1,6],[2,1,2,2],[2,3,2,6],[3,1,3,2],[3,3,3,5],[3,6,7,6],[4,1,5,2],[4,3,4,5],[5,3,5,4],[6,1,7,2],[6,3,7,5],[10,5,10,6]]}
[null,{"$f":"INFORMATION!A1","v":"Document basé sur la norme NF EN 62198"},null,null,null,null,"Impression sur pages A4 100% en format horizontal"]
[null,{"$f":"INFORMATION!B3","v":"SYSTÈME DE MANAGEMENT DES RISQUES DES PROJETS"}]
[null,{"$f":"INFORMATION!A7","v":"Etablissement :"},null,{"$f":"INFORMATION!D7","v":"Nom de l'établissement / entreprise / service..."}]
[null,"Date de l'autodiagnostic : ",null,null,null,null,"Signature du responsable de l'autodiagnostic :\n\n\n\n\n"]
[null,"Responsable de l'autodiagnostic : ",null,"NOM et Prénom"]
[null,null,null,"Tél :",null,"@ :"]
[null,"L'équipe du projet :",null,"Nom et Prénom des participants"]
[]
[null,"Attention : Le calcul de taux (%) ne prend pas en compte les questions où vous avez répondu \"Non Concerné\". ",null,null,null,null,null,null,null,null,null,null,null,null,null,null,null,"TABLEAU DE FORMULES"]
[null,"Rec.","Recommandations de la norme","Evaluation","Taux %","Libellés \ndes évaluations","Modes de preuve \net commentaires",null,null,null,null,null,null,null,null,"Automatique : pondération de chaque exigence","Taux de CONFORMITÉ pondéré sur l'exigence","Niveau de RESPECT pour le sous-article",null,"Automatique : pondération de chaque sous- chapitre","Taux  moyen de CONFORMITÉ pondéré pour le sous-article",null,"Somme des pondérations des Articles","Taux moyen de conformité sur la Norme","Niveau de RESPECT pour la norme"]
[null,"P1","Processus Pilotage",{"$f":"V11","v":"Niveau non concerné"},{"$f":"IF($D11=\"Niveau non concerné\",\"NC\",U11)","v":"NC"},{"$f":"IFERROR(IF(E11=INFORMATION!$G$24,INFORMATION!$H$24,IF(E11<=INFORMATION!$F$20,INFORMATION!$H$20,IF(E11<=INFORMATION!$F$21,INFORMATION!$H$21,IF(E11<=INFORMATION!$F$22,INFORMATION!$H$22,INFORMATION!$H$23)))),\"\")","v":"Niveau non concerné"},null,null,null,null,"Quantité des questions","Choix Réalisé","Nº du choix","% Veracité du choix","NA","Somme des pondérations sur les exigences","Taux  moyen de CONFORMITÉ pour le sous-article","vérifier si Somme = 1 =>  ","NA",{"$f":"SUM(T12:T34)","v":0},{"$f":"IFERROR(SUM(U12:U34),\"\")","v":0},{"$f":"IFERROR(IF(U11=INFORMATION!$D$24,INFORMATION!$H$24,IF(U11<=INFORMATION!$F$20,INFORMATION!$G$20,IF(U11<=INFORMATION!$F$21,INFORMATION!$G$21,IF(U11<=INFORMATION!$F$22,INFORMATION!$G$22,INFORMATION!$G$23)))),\"\")","v":"Niveau non concerné"},{"$f":"1/3","v":0.33333333333333331},{"$f":"U11*W11","v":0}]
[null,"Gr1","Elaboration de la stratégie de Management des Risques liés à un projet ",{"$f":"R12","v":"Niveau non concerné"},{"$f":"IF($D12=\"Niveau non concerné\",\"NC\",$Q12)","v":"NC"},{"$f":"IFERROR(IF(E12=INFORMATION!$G$24,INFORMATION!$H$24,IF(E12<=INFORMATION!$F$20,INFORMATION!$H$20,IF(E12<=INFORMATION!$F$21,INFORMATION!$H$21,IF(E12<=INFORMATION!$F$22,INFORMATION!$H$22,INFORMATION!$H$23)))),\"\")","v":"Niveau non concerné"},null,null,null,null,"Nb critères","Sous-Article",null,"vérifier si Somme = 1 =>  ",null,{"$f":"SUM(P13:P22)","v":0.99999999999999989},{"$f":"IFERROR(SUM(Q13:Q22),\"\")","v":0},{"$f":"IFERROR(IF(Q12=INFORMATION!$F$24,INFORMATION!$H$24,IF(Q12<=INFORMATION!$F$20,INFORMATION!$G$20,IF(Q12<=INFORMATION!$F$21,INFORMATION!$G$21,IF(Q12<=INFORMATION!$F$22,INFORMATION!$G$22,INFORMATION!$G$23)))),\"\")","v":"Niveau non concerné"},{"$f":"IF(R12=\"Niveau non concerné\",1,0)","v":1},{"$f":"IF(R12=\"Niveau non concerné\",0,1/COUNTIF($S$12:$S$33,\"=0\"))","v":0},{"$f":"T12*Q12","v":0},null,null,null,null,null,"Faux"]
[null,"Rec01","La politique et le processus de management des risques liés au projet sont définis et intégrés dans les processus de gestion de projet et approuvés par la direction.",null,{"$f":"IF($D13=\"Non concerné\",\"NC\",$N13)","v":""},{"$f":"IF(D13=\"\",\"\",CHOOSE($M13,\"Libellé du critère quand il sera choisi\",INFORMATION!$A$20,INFORMATION!$A$21,INFORMATION!$A$22,INFORMATION!$A$23,\"Non concerné\"))","v":""},"Vous pouvez commenter",null,null,null,1,{"$f":"$D13","v":0},{"$f":"IFERROR((VLOOKUP($D13,INFORMATION!$M$20:$N$24,2,FALSE)),\"\")","v":""},{"$f":"IFERROR(CHOOSE($M13,\"\",INFORMATION!$D$20,INFORMATION!$D$21,INFORMATION!$D$22,INFORMATION!$D$23,INFORMATION!$D$24),\"\")","v":""},{"$f":"IF(L13=\"Non Concerné\",1,0)","v":0},{"$f":"IF(L13=\"Non Concerné\",0,1/COUNTIF($O$13:$O$22,\"=0\"))","v":0.1},{"$f":"IFERROR(N13*P13,\"\")","v":""},null,null,null,null,null,null,null,null,null,"Plutôt Faux"]
[null,"Rec02","Le processus de management des risques, ainsi que les risques et leur traitement sont documentés.",null,{"$f":"IF($D14=\"Non concerné\",\"NC\",$N14)","v":""},{"$f":"IF(D14=\"\",\"\",CHOOSE($M14,\"Libellé du critère quand il sera choisi\",INFORMATION!$A$20,INFORMATION!$A$21,INFORMATION!$A$22,INFORMATION!$A$23,\"Non concerné\"))","v":""},"Vous pouvez commenter",null,null,null,{"$f":"K13+1","v":2},{"$f":"D14","v":0},{"$f":"IFERROR((VLOOKUP($D14,INFORMATION!$M$20:$N$24,2,FALSE)),\"\")","v":""},{"$f":"IFERROR(CHOOSE($M14,\"\",INFORMATION!$D$20,INFORMATION!$D$21,INFORMATION!$D$22,INFORMATION!$D$23,INFORMATION!$D$24),\"\")","v":""},{"$f":"IF(L14=\"Non Concerné\",1,0)","v":0},{"$f":"IF(L14=\"Non Concerné\",0,1/COUNTIF($O$13:$O$22,\"=0\"))","v":0.1},"",null,null,null,null,null,null,null,null,null,"Plutôt Vrai"]
[null,"Rec03","La politique et les avantages de management des risques est communiquée à toutes les parties prenantes du projet.",null,"",{"$f":"IF(D15=\"\",\"\",CHOOSE($M15,\"Libellé du critère quand il sera choisi\",INFORMATION!$A$20,INFORMATION!$A$21,INFORMATION!$A$22,INFORMATION!$A$23,\"Non concerné\"))","v":""},"Vous pouvez commenter",null,null,null,{"$f":"K14+1","v":3},0,{"$f":"IFERROR((VLOOKUP($D15,INFORMATION!$M$20:$N$24,2,FALSE)),\"\")","v":""},{"$f":"IFERROR(CHOOSE($M15,\"\",INFORMATION!$D$20,INFORMATION!$D$21,INFORMATION!$D$22,INFORMATION!$D$23,INFORMATION!$D$24),\"\")","v":""},0,{"$f":"IF(L15=\"Non Concerné\",0,1/COUNTIF($O$13:$O$22,\"=0\"))","v":0.1},{"$f":"IFERROR(N15*P15,\"\")","v":""},null,null,null,null,null,null,null,null,null,"Vrai"]
{"$rows_left_out":58}
{"sheet":"Résultats","index":3,"n_rows":47,"n_cols":25,"rows_kept":47,"cut":false,"hidden":false,"merged":[[15,1,15,4],[30,1,30,8],[21,1,21,8],[22,1,22,5],[22,6,22,8],[23,6,23,8],[24,6,24,8],[28,1,28,5],[1,1,1,8],[3,1,3,2],[3,3,3,4],[4,1,4,2],[4,3,4,4],[4,7,5,8],[5,1,5,2],[7,1,7,8],[8,1,8,4],[8,5,8,8],[12,1,12,4],[14,1,14,4],[13,1,13,4],[9,5,9,6]]}
[null,{"$f":"INFORMATION!A1","v":"Document basé sur la norme NF EN 62198"},null,null,null,null,null,null,"Impression sur pages A4 100% en format horizontal"]
[null,{"$f":"INFORMATION!B3","v":"SYSTÈME DE MANAGEMENT DES RISQUES DES PROJETS"}]
[]
[null,{"$f":"INFORMATION!A7","v":"Etablissement :"},null,{"$f":"INFORMATION!D7","v":"Nom de l'établissement / entreprise / service..."},null,{"$f":"Recommandations!B4","v":"Date de l'autodiagnostic : "},{"$f":"IFERROR(IF(Recommandations!D4=\"\",\"\",Recommandations!D4),\"\")","v":""},{"$f":"Recommandations!B7","v":"L'équipe du projet :"}]
[null,{"$f":"INFORMATION!A8","v":" Responsable du SMR Projets : "},null,{"$f":"INFORMATION!D8","v":"NOM et Prénom du Responsable Qualité"},null,"Responsable :",{"$f":"IF(Recommandations!D5=\"\",\"\",Recommandations!D5)","v":"NOM et Prénom"},{"$f":"Recommandations!D7","v":"Nom et Prénom des participants"}]
[null,null,null,{"$f":"INFORMATION!D9","v":"Email :"},{"$f":"INFORMATION!H9","v":"Tél :"},{"$f":"Recommandations!D6","v":"Tél :"},{"$f":"Recommandations!F6","v":"@ :"}]
[]
[null,"TABLEAUX DE BORD de vos réponses aux LIGNES DIRECTRICES à la norme NF EN 62198:2014",null,null,null,null,null,null,null,null,null,null,null,null,"Utilitaires pour les CALCULS et les GRAPHIQUES"]
[null,{"$f":"CONCATENATE(\"Niveaux de VÉRACITÉ des \", U12,  \" recommandations évaluées\")","v":"Niveaux de VÉRACITÉ des 48 recommandations évaluées"},null,null,null,"Résultat global par processus"]
[null,null,null,null,null,"Moyenne générale :",null,{"$f":"H33","v":{"$error":"#VALUE!"}},{"$f":"F33","v":""},null,null,null,"Histogramme des niveaux de CONFORMITÉ",null,null,null,null,"Histogramme des niveaux de VÉRACITÉ"]
[null,null,null,null,null,null,null,null,null,null,null,null,"CONFORMITÉ","Nb d'Articles","Tracer la moyenne",null,"VÉRACITÉ",null,"Nb de critères d'exigences","Ecart vs Total des critères","Total des critères","Total des recommandations"]
[null,null,null,null,null,null,null,null,null,null,null,null,"Niveaux",{"$f":"SUM(N13:N16)","v":0},": Total ou 0",{"$f":"U12/4","v":12},"Niveaux","N°",{"$f":"SUM(S13:S16)","v":0},{"$f":"48-(S12+S17)","v":48},{"$f":"(MAX(Recommandations!K13:K72)-S17)","v":48},{"$f":"S12+S17","v":0}]
[null,{"$f":"CONCATENATE(\"Attention : \",$S$17,\" recommandations ne sont pas concernées\")","v":"Attention : 0 recommandations ne sont pas concernées"},null,null,null,null,null,null,null,null,null,null,{"$f":"INFORMATION!G20","v":"Insuffisant"},{"$f":"IFERROR(COUNTIFS($G$35:$G$47,M13),0)","v":0},{"$f":"IF($F$33=M13,$P$12,0)","v":0},null,"Faux",{"$f":"INFORMATION!N20","v":2},{"$f":"IFERROR(COUNTIFS(Recommandations!$M:$M,Résultats!$R13),0)","v":0},null,null,{"$f":"S12+S17","v":0}]
[null,{"$f":"IF($S$12<$U$12,CONCATENATE(\"Attention : \",$T$12,\" recommandations ne sont pas encore traités\"),\"\")","v":"Attention : 48 recommandations ne sont pas encore traités"},null,null,null,null,null,null,null,null,null,null,{"$f":"INFORMATION!G21","v":"Incomplet"},{"$f":"IFERROR(COUNTIFS($G$35:$G$47,M14),0)","v":0},{"$f":"IF($F$33=M14,$P$12,0)","v":0},null,"Plutôt Faux",{"$f":"INFORMATION!N21","v":3},{"$f":"IFERROR(COUNTIFS(Recommandations!$M:$M,Résultats!$R14),0)","v":0},null,null,{"$f":"V12-V13","v":0}]
[null,"Niveaux de SUIVI des PROCESSUS par rapport à la norme (et Moyenne)",null,null,null,null,null,null,null,null,null,null,{"$f":"INFORMATION!G22","v":"Satisfaisant"},{"$f":"IFERROR(COUNTIFS($G$35:$G$47,M15),0)","v":0},0,null,"Plutôt Vrai",{"$f":"INFORMATION!N22","v":4},{"$f":"IFERROR(COUNTIFS(Recommandations!$M:$M,Résultats!$R15),0)","v":0}]
{"$rows_left_out":33}
{"sheet":"Détaillé","index":4,"n_rows":33,"n_cols":9,"rows_kept":33,"cut":false,"hidden":false,"merged":[[1,1,1,8],[26,6,26,8],[27,6,27,8],[28,6,28,8],[3,1,3,2],[3,3,3,4],[4,7,5,8],[8,6,8,8],[3,7,3,8],[4,1,4,2],[4,3,4,4],[5,1,5,2],[9,6,9,8],[10,6,10,8],[19,6,19,8],[17,6,17,8],[18,6,18,8]]}
[null,{"$f":"INFORMATION!A1","v":"Document basé sur la norme NF EN 62198"},null,null,null,null,null,null,"Impression sur pages A4 100% en format horizontal"]
[null,{"$f":"INFORMATION!B3","v":"SYSTÈME DE MANAGEMENT DES RISQUES DES PROJETS"}]
[]
[null,{"$f":"INFORMATION!A7","v":"Etablissement :"},null,{"$f":"INFORMATION!D7","v":"Nom de l'établissement / entreprise / service..."},null,{"$f":"Recommandations!B4","v":"Date de l'autodiagnostic : "},{"$f":"IFERROR(IF(Recommandations!D4=\"\",\"\",Recommandations!D4),\"\")","v":""},{"$f":"Recommandations!B7","v":"L'équipe du projet :"}]
[null,{"$f":"INFORMATION!A8","v":" Responsable du SMR Projets : "},null,{"$f":"INFORMATION!D8","v":"NOM et Prénom du Responsable Qualité"},null,"Responsable : ",{"$f":"Recommandations!D5","v":"NOM et Prénom"},{"$f":"Recommandations!D7","v":"Nom et Prénom des participants"}]
[null,null,null,{"$f":"INFORMATION!D9","v":"Email :"},{"$f":"INFORMATION!H9","v":"Tél :"},{"$f":"Recommandations!D6","v":"Tél :"},{"$f":"Recommandations!F6","v":"@ :"}]
[]
[null,null,{"$f":"Recommandations!B11","v":"P1"},{"$f":"Recommandations!C11","v":"Processus Pilotage"}]
[null,null,"Niveau d'évaluation"," Taux de VÉRACITÉ aux recommandations",null,null,"COMMENTAIRES sur les RÉSULTATS obtenus"]
[null,null,{"$f":"Résultats!F34","v":"Niveau non concerné"},{"$f":"IF(C10=\"Niveau non concerné\",\"NA\",Résultats!H34)","v":"NA"},null,null,"Commentaires :"]
[null,null,null,null,null,null,"DÉCISION : Plan d'action PRIORITAIRE"]
[null,null,null,null,null,null,"QUOI\nObjectifs à atteindre","QUI\nen Interne ou en Externe","QUAND ET OÙ\nDate et Champ d'application"]
[null,null,null,null,null,null,"Action n°1 :"]
[null,null,null,null,null,null,"Action n°2 :"]
[null,null,null,null,null,null,"Action n°3 :"]
{"$rows_left_out":19}
{"sheet":"Déclaration","index":5,"n_rows":34,"n_cols":6,"rows_kept":34,"cut":false,"hidden":false,"merged":[[32,0,32,2],[28,0,28,2],[28,3,28,5],[29,0,29,2],[29,3,29,5],[30,0,30,2],[30,3,30,4],[27,0,27,2],[27,3,27,5],[15,0,15,5],[16,0,16,5],[19,0,19,2],[19,3,19,5],[20,0,20,2],[20,3,20,5],[21,0,21,2],[21,3,21,5],[23,0,23,5],[25,0,25,2],[25,3,25,5],[17,0,17,5],[18,0,18,5],[11,0,11,3],[1,0,1,5],[3,0,3,5],[4,0,4,2],[4,3,4,5],[5,0,5,2],[5,3,5,5],[6,0,6,5],[7,0,7,5],[8,0,8,5],[9,0,9,5],[10,0,10,3],[2,0,2,5]]}
[{"$f":"INFORMATION!A1","v":"Document basé sur la norme NF EN 62198"},null,null,null,null,"Impression sur 1 page A4 100% en vertical"]
["SYSTÈME DE MANAGEMENT DES RISQUES DES PROJETS"]
[{"$f":"\"- LA QUALITÉ POUR PERFORMER -\"","v":"- LA QUALITÉ POUR PERFORMER -"}]
["Déclaration de véracité aux recommandations de la norme NF EN 62198"]
["Date limite de validité de la déclaration :",null,null,"Référence unique de la déclaration NF EN 62198"]
[{"$f":"IFERROR(A33+364,\"Date de la déclaration + 1 an\")","v":"Date de la déclaration + 1 an"},null,null,{"$f":"IF(A33=\"\",\"remplir la cellule de date de la déclaration (onglet ISO 17050)\",IF(ISERROR(YEAR(A33)),\"date de la déclaration invalide\",CONCATENATE(\"Autodeclaration_ISO_17050_sur_la_NF_S99-170_en_\",YEAR(A33),\"_\",MONTH(A33),\"_\",DAY(A33))))","v":"date de la déclaration invalide"}]
["Objet de la déclaration : Niveau de VÉRACITÉ aux RECOMMANDATIONS selon l'outil d'autodiagnostic"]
[{"$f":"INFORMATION!D7","v":"Nom de l'établissement / entreprise / service..."}]
["Nous soussignés, déclarons sous notre propre responsabilité que les niveaux de correspondance de nos pratiques professionnelles ont été mesurés d'après les recommandations de la norme NF EN 62198:2014."]
["Nous avons appliqué la meilleure rigueur d'élaboration et d'analyse (évaluation par plusieurs personnes compétentes) et nous avons respecté les règles d'éthique professionnelle (absence de conflits d'intérêt, respect des opinions, liberté des choix) pour parvenir aux résultats ci-dessous."]
["Tableau des résultats de VÉRACITÉ de nos activités \nselon les recommandations tirées de la norme NF EN 62198:2014",null,null,null,"Taux moyen","Niveaux de Correspondance"]
[{"$f":"Résultats!B33","v":"Niveau moyen sur l'ensemble des recommandations"},null,null,null,{"$f":"Résultats!H33","v":{"$error":"#VALUE!"}},{"$f":"IF(Résultats!$G$33=INFORMATION!$G$23,Résultats!$G$33,\"Non déclarable\")","v":"Non déclarable"}]
[{"$f":"Résultats!B34","v":"P1"},{"$f":"Résultats!C34","v":"Processus Pilotage"},null,null,{"$f":"Résultats!H34","v":"NC"},{"$f":"IF(Résultats!$F$34=INFORMATION!$G$23,Résultats!F34,\"Non déclarable\")","v":"Non déclarable"}]
[{"$f":"Résultats!B39","v":"P2"},{"$f":"Résultats!C39","v":"Processus Réalisation"},null,null,{"$f":"Résultats!H39","v":"NC"},{"$f":"IF(Résultats!$F$39=INFORMATION!$G$23,Résultats!$F$39,\"Non déclarable\")","v":"Non déclarable"}]
[{"$f":"Résultats!B44","v":"P3"},{"$f":"Résultats!C44","v":"Processus Support"},null,null,{"$f":"Résultats!H44","v":"NC"},{"$f":"IF(Résultats!$F$44=INFORMATION!$G$23,Résultats!$F$44,\"Non déclarable\")","v":"Non déclarable"}]
{"$rows_left_out":19}