{"text_format":"1","workbook":"xlsx","n_sheets":9,"sheets":["Information","Conseils","Problématiser","Analyser le budget","Expérimenter","Prioriser","Directives","Prise de décisions","Innover"],"not_rendered":{"charts":8,"images":18,"macros":1,"external_links":0,"defined_names":15,"comments":1,"pivot_tables":0},"unopened":[],"bounds":{"document_bytes":16777216,"sheet_cells":100000,"rows_first":2000,"rows_last":500,"rows_between":2000,"halvings":0,"cell_chars":16384,"cell_head_chars":4096},"cells_cut":0,"cells_raw":0,"read":"whole","date_system":"1900"}

{"sheet":"Information","index":0,"n_rows":25,"n_cols":14,"rows_kept":25,"cut":false,"hidden":false,"merged":[[1,1,1,8],[2,1,2,8],[3,1,3,8],[22,0,22,1],[17,0,17,1],[4,0,4,8],[10,0,10,8],[16,4,16,8],[6,3,6,8],[7,7,7,8],[16,0,16,3],[6,0,6,2],[7,0,7,2],[7,3,7,6],[12,4,12,8],[5,0,5,2],[12,0,12,3],[11,4,11,8],[13,0,14,3],[15,0,15,2],[11,0,11,3],[2,10,3,10],[24,0,24,8],[18,0,18,1],[17,7,17,8],[18,7,18,8],[23,0,23,8],[21,0,21,1],[20,0,20,1],[19,0,19,1],[19,7,19,8],[20,7,20,8],[21,7,21,8],[5,3,5,8],[8,0,8,2],[8,3,8,8],[22,7,22,8]]}
["Document basé sur la méthode PEPI:2018",null,null,null,null,null,null,null,"Enregistrement qualité :  A4 100% vertical"]
[null,"Lignes directrices d'un plan d'expérience innovant applicable à plusieurs secteurs de l'industrie"]
[null,{"$f":"\"- PEPI - \nPlan d'Expérience pour la Performance Innovante,\n un outil pour l'industrie\"","v":"- PEPI - \nPlan d'Expérience pour la Performance Innovante,\n un outil pour l'industrie"},null,null,null,null,null,null,null,null,"Attention : Cet outil a été développé avec le système d'exploitation Windows. Si vous l'utilisez dois Mac ou souhaitez l'imprimer, il se peut que la mise en page soit midifiée.  "]
[null,{"$f":"\"- LE CHOIX D'UNE STRATEGIE GAGANTE  -\"","v":"- LE CHOIX D'UNE STRATEGIE GAGANTE  -"}]
["Attention : Seules les cases blanches écrites en bleu peuvent être modifiées par l’utilisateur. Cela concerne toutes les parties de l’outil."]
["Etablissement :",null,null,"Nom de l'établissement / entreprise / service..."]
[" Responsable d'appliquer PEPI : ",null,null,"NOM et Prénom du Responsable Qualité"]
[" Contact du responsable :",null,null,"Email :",null,null,null,"Tél :"]
["Projet Évalué :",null,null,"Nom du Projet"]
[]
["TABLEAU DE PRÉSENTATION"]
["LETTRE AUX UTILISATEURS",null,null,null,"DESCRIPTION DE PEPI"]
["PEPI, Plan d'Expérience pour la Performance Innovante, vous propose une manière facile et différente de mettre en évidence des paramètres significatifs pour l'évolution continue de la performance industriel. Il vous est destiné à vous, les responsables de projets, les responsables de production, les ingénieurs, les dirigeants, afin de vous offrir un support à la prise de décisions. Gratuit, il est simple d'utilisation et applicable à plusieurs secteurs industriels. \n\nCet outil est aussi votre tableau de bord pour suivre, commenter et préparer les étapes du projet. De plus, il augmentera votre visibilité afin de minimiser les incertitudes. \n\nL'outil est composé de quatre parties respectant l'évolution du projet.\n\nL'équipe PEPI vous souhaite un bon travail.",null,null,null,"PEPI est un outil sous format Excel constitué de neuf onglets :\n- INFORMATION : Explique l'objectif de l'outil et les critères d'évaluation\n    - CONSEILS : Conaissances nécessaires pour appliquer PEPI\n- PROBLEMATISER : Tous les outils nécessaires pour identifier les éléments principaux de la problématique du porjet\n- ANALYSE DE BUDGET : Analyser les budgets spécifiques du projet \n- EXPERIMENTER : Mettre en évidence les données importantes et essentielles concernant le projet à la réalisation du plan d'expérience \n    - PRIORISER : Des directives por la prise de décision\n    - DIRECTIVES : Vision global des résultats d'état des directives\n    - PRISE DE DECISIONS : Résumé chiffré et détaillé des directives évaluées, ainsi que du plan d'action à mettre en œuvre\n- INNOVER : Des conseils de PEPI sont présentés, ainsi qu’un schéma afin d’illustrer le processus."]
[{"$f":"\" - LE CHOIX D'UNE STRATEGIE GAGANTE - \"","v":" - LE CHOIX D'UNE STRATEGIE GAGANTE - "},null,null,null,null,null,null,null,null,null,null,null,"Utilitaires pour l'outil PEPI"]
[null,null,null,null,null,null,null,null,null,null,null,null,"Paramétrage des affectations selon le N° du choix"]
{"$rows_left_out":11}
{"sheet":"Conseils","index":1,"n_rows":148,"n_cols":7,"rows_kept":148,"cut":false,"hidden":false,"merged":[[36,1,36,11],[37,1,38,11],[8,1,19,7],[20,6,34,11],[1,1,1,11],[2,1,2,11],[3,1,3,11],[5,1,5,11],[7,1,7,11],[65,1,80,6],[82,1,82,11],[83,1,95,11],[49,1,49,11],[50,1,62,6],[64,1,64,11],[147,1,157,11],[110,1,110,11],[111,1,115,11],[127,1,127,11],[128,1,138,11],[146,1,146,11]]}
[]
[null,{"$f":"Information!B2","v":"Lignes directrices d'un plan d'expérience innovant applicable à plusieurs secteurs de l'industrie"}]
[null,{"$f":"Information!B3","v":"- PEPI - \nPlan d'Expérience pour la Performance Innovante,\n un outil pour l'industrie"}]
[null,{"$f":"Information!B4","v":"- LE CHOIX D'UNE STRATEGIE GAGANTE  -"}]
[]
[null,"CONSEILS"]
[]
[null,"1. Approche méthodologique"]
[null,"PEPI, le « Plan d’Expérience pour la Performance Innovante » est un outil stratégique gagnant. Basé d’abord sur l’interprétation de résultats expérimentaux puis sur l’innovation des processus de production. PEPI a été créé dans le but de proposer à l’industrie une façon flexible et différente de résoudre ses problèmes et d’aider les industries à prendre les décisions. \n"]
[]
[]
[]
[]
[]
[]
{"$rows_left_out":134}
{"sheet":"Problématiser","index":2,"n_rows":130,"n_cols":7,"rows_kept":130,"cut":false,"hidden":false,"merged":[[129,2,133,5],[101,1,101,6],[107,6,112,6],[127,1,127,6],[118,1,118,6],[98,3,98,4],[92,5,92,6],[93,5,93,6],[94,5,94,6],[95,5,95,6],[96,5,96,6],[97,5,97,6],[98,5,98,6],[96,3,96,4],[92,3,92,4],[93,3,93,4],[94,3,94,4],[95,3,95,4],[97,3,97,4],[89,3,89,4],[90,3,90,4],[84,5,84,6],[85,5,85,6],[86,5,86,6],[87,5,87,6],[88,5,88,6],[89,5,89,6],[90,5,90,6],[92,2,98,2],[84,3,84,4],[85,3,85,4],[86,3,86,4],[77,1,78,1],[77,2,78,6],[80,1,80,6],[82,3,82,4],[82,5,82,6],[83,3,83,4],[83,5,83,6],[91,3,91,4],[91,5,91,6],[84,2,90,2],[87,3,87,4],[88,3,88,4],[71,1,72,1],[71,2,72,6],[73,1,74,1],[73,2,74,6],[75,1,76,1],[75,2,76,6],[65,1,66,1],[65,2,66,6],[67,1,68,1],[67,2,68,6],[69,1,70,1],[69,2,70,6],[41,3,42,5],[44,3,45,5],[48,1,48,6],[49,1,49,6],[26,3,27,5],[29,3,30,5],[32,3,33,5],[35,3,36,5],[38,3,39,5],[24,1,24,2],[1,1,1,6],[2,1,2,2],[2,3,2,6],[3,1,3,2],[3,3,3,5],[3,6,7,6],[4,1,5,2],[4,3,4,5],[5,3,5,4],[6,1,7,2],[6,3,7,5],[9,1,9,6],[11,1,12,6],[10,1,10,6],[23,1,23,6]]}
[]
[null,{"$f":"Information!B3","v":"- PEPI - \nPlan d'Expérience pour la Performance Innovante,\n un outil pour l'industrie"}]
[null,{"$f":"Information!$A$6","v":"Etablissement :"},null,{"$f":"Information!D6","v":"Nom de l'établissement / entreprise / service..."}]
[null,"Date d'application de problématiser : ",null,"Date",null,null,"Signature du responsable du projet :\n\n\n\n\n"]
[null,"Responsable du projet :",null,"NOM et Prénom"]
[null,null,null,"Tél :",null,"@ :"]
[null,"L'équipe du projet :",null,"Nom et Prénom des participants"]
[]
[]
[null,"PROBLEMATISER"]
[null,"Avant-propos"]
[null,"Appliquer les sous-étapes comme montre la figure ci-dessous."]
[]
[]
[]
{"$rows_left_out":116}
{"sheet":"Analyser le budget","index":3,"n_rows":49,"n_cols":10,"rows_kept":49,"cut":false,"hidden":false,"merged":[[1,1,1,9],[3,1,3,5],[5,1,5,5],[6,1,6,5],[12,1,38,1],[4,1,4,5],[4,6,4,9],[5,6,5,9],[6,6,6,9],[8,1,8,9],[39,1,47,4],[48,1,48,5],[3,6,3,9],[21,3,29,4],[30,2,38,4],[12,2,29,2],[12,3,20,3],[12,4,20,4],[10,5,11,5],[10,6,11,6],[10,7,11,7],[10,8,11,8],[10,9,11,9]]}
[]
[null,{"$f":"+Information!B3","v":"- PEPI - \nPlan d'Expérience pour la Performance Innovante,\n un outil pour l'industrie"}]
[]
[null,{"$f":"Problématiser!B3","v":"Etablissement :"},null,null,null,null,{"$f":"Problématiser!D3","v":"Nom de l'établissement / entreprise / service..."}]
[null,{"$f":"Problématiser!B4","v":"Date d'application de problématiser : "},null,null,null,null,{"$f":"Problématiser!D4","v":"Date"}]
[null,{"$f":"Problématiser!B5","v":"Responsable du projet :"},null,null,null,null,{"$f":"Problématiser!D5","v":"NOM et Prénom"}]
[null,{"$f":"Problématiser!B7","v":"L'équipe du projet :"},null,null,null,null,{"$f":"Problématiser!D7","v":"Nom et Prénom des participants"}]
[]
[null,"TABLEAU D'ANALYSE DE BUDGET TOUT AU LONG DU PROJET"]
[]
[null,null,null,null,null,"Description","Quantité","Prix unitaire","Prix Total","Détails"]
[]
[null,null,null,null,"PROBLEMATISER","Ex : budget de vente",null,null,{"$f":"H13*G13","v":0}]
[null,null,null,null,null,"Ex : budget de production",null,null,{"$f":"H14*G14","v":0}]
[null,null,null,null,null,"Ex : budget des matières premières",null,null,0]
{"$rows_left_out":35}
{"sheet":"Expérimenter","index":4,"n_rows":21,"n_cols":29,"rows_kept":21,"cut":false,"hidden":false,"merged":[[9,7,9,25],[9,26,9,28],[1,1,1,28],[3,7,3,28],[4,7,4,28],[5,7,5,28],[6,7,6,28],[3,1,3,6],[4,1,4,6],[5,1,5,6],[6,1,6,6]]}
[]
[null,{"$f":"+Information!B3","v":"- PEPI - \nPlan d'Expérience pour la Performance Innovante,\n un outil pour l'industrie"}]
[]
[null,{"$f":"Problématiser!B3","v":"Etablissement :"},null,null,null,null,null,{"$f":"Problématiser!D3","v":"Nom de l'établissement / entreprise / service..."}]
[null,{"$f":"Problématiser!B4","v":"Date d'application de problématiser : "},null,null,null,null,null,{"$f":"Problématiser!D4","v":"Date"}]
[null,{"$f":"Problématiser!B5","v":"Responsable du projet :"},null,null,null,null,null,{"$f":"Problématiser!D5","v":"NOM et Prénom"}]
[null,{"$f":"Problématiser!B7","v":"L'équipe du projet :"},null,null,null,null,null,{"$f":"Problématiser!D7","v":"Nom et Prénom des participants"}]
[]
[]
[null,null,null,null,null,null,null,"Tests croisés si nécessaire",null,null,null,null,null,null,null,null,null,null,null,null,null,null,null,null,null,null,"Données essencielles "]
[null,"N°","Dispositif étudié","Facteur(s) à évaluer","Information sur l'état","Origine","Analyse à réaliser","Test N°","Dispositif","Dispositif","Dispositif","Dispositif","Dispositif","Dispositif","Dispositif","Dispositif","Dispositif","Dispositif","Dispositif","Dispositif","Dispositif","Dispositif","Dispositif","Dispositif","Dispositif","Dispositif","Ex : Surface","Ex : Volume","Ex : Quantité testée"]
[null,1,"Dispositif 1",null,null,null,null,1]
[null,2,"Dispositif 2",null,null,null,null,2]
[null,3,"Dispositif 3",null,null,null,null,3]
[null,4,"Dispositif 4",null,null,null,null,4]
{"$rows_left_out":7}
{"sheet":"Prioriser","index":5,"n_rows":71,"n_cols":27,"rows_kept":71,"cut":false,"hidden":false,"merged":[[68,5,68,6],[33,5,33,6],[45,5,45,6],[46,5,46,6],[52,5,52,6],[59,5,59,6],[38,5,38,6],[23,5,23,6],[58,5,58,6],[27,5,27,6],[64,5,64,6],[15,5,15,6],[18,5,18,6],[8,1,8,6],[12,8,14,8],[21,8,22,8],[1,1,1,6],[2,1,2,2],[2,3,2,6],[3,1,3,2],[3,3,3,5],[3,6,7,6],[4,1,5,2],[4,3,4,5],[5,3,5,4],[6,1,7,2],[6,3,7,5],[10,5,10,6],[11,5,11,6]]}
[null,{"$f":"Information!A1","v":"Document basé sur la méthode PEPI:2018"},null,null,null,null,"Impression sur pages A4 100% en format horizontal"]
[null,{"$f":"Information!B3","v":"- PEPI - \nPlan d'Expérience pour la Performance Innovante,\n un outil pour l'industrie"}]
[null,{"$f":"Information!$A$6","v":"Etablissement :"},null,{"$f":"Information!D6","v":"Nom de l'établissement / entreprise / service..."}]
[null,"Date d'application de prioriser : ",null,"Date",null,null,"Signature du responsable du projet :\n\n\n\n\n"]
[null,"Responsable du projet :",null,{"$f":"Problématiser!D5","v":"NOM et Prénom"}]
[null,null,null,{"$f":"Problématiser!D6","v":"Tél :"},null,{"$f":"Problématiser!F6","v":"@ :"}]
[null,"L'équipe du projet :",null,{"$f":"Problématiser!D7","v":"Nom et Prénom des participants"}]
[]
[null,"Attention : Le calcul de taux (%) ne prend pas en compte les questions où vous avez répondu \"Non Concerné\". ",null,null,null,null,null,null,null,null,null,null,null,null,null,null,null,"TABLEAU DE FORMULES"]
[null,"Dir.","Directives de PEPI","Evaluation","Taux %","Libellés \ndes évaluations","Modes de preuve \net commentaires",null,null,null,null,null,null,null,null,"Automatique : pondération de chaque directive","Taux de PRIORITE pondéré sur le directive","Niveau de PRIORITE pour le sous-groupes",null,"Automatique : pondération de chaque sous-GROUPE","Taux  moyen de PRIORITÉ pondéré pour le sous-groupes",null,"Somme des pondérations des groupes","Taux moyen de conformité sur PEPI","Niveau d'importance "]
[null,"Groupe 1","Le projet dans son ensemble",{"$f":"V11","v":"Niveau non concerné"},{"$f":"IF($D11=\"Niveau non concerné\",\"Non concerné\",U11)","v":"Non concerné"},{"$f":"IFERROR(IF(E11=Information!$G$23,Information!$H$23,IF(E11<=Information!$F$19,Information!$H$19,IF(E11<=Information!$F$20,Information!$H$20,IF(E11<=Information!$F$21,Information!$H$21,Information!$H$22)))),\"\")","v":"Niveau non concerné"},null,null,null,null,"Quantité des directives","Choix Réalisé",null,"% Veracité du choix",null,"Somme des pondérations sur les directives","Taux  moyen de PRIORITE pour le sous-groupes","vérifier si Somme = 1 =>  ",null,{"$f":"SUM(T12:T45)","v":0},{"$f":"IFERROR(SUM(U12:U45),\"\")","v":0},{"$f":"IFERROR(IF(U11=Information!$D$23,Information!$H$23,IF(U11<=Information!$F$19,Information!$G$19,IF(U11<=Information!$F$20,Information!$G$20,IF(U11<=Information!$F$21,Information!$G$21,Information!$G$22)))),\"\")","v":"Niveau non concerné"},{"$f":"1/3","v":0.33333333333333331},{"$f":"U11*W11","v":0},{"$f":"IFERROR(IF(X11=Information!$F$23,Information!$H$23,IF(X11<=Information!$F$19,Information!$G$19,IF(X11<=Information!$F$20,Information!$G$20,IF(X11<=Information!$F$21,Information!$G$21,Information!$G$22)))),\"\")","v":"Niveau non concerné"},{"$f":"IFERROR(IF(U11=Information!$G$23,Information!$H$23,IF(U11<=Information!$F$19,Information!$H$19,IF(U11<=Information!$F$20,Information!$H$20,IF(U11<=Information!$F$21,Information!$H$21,Information!$H$22)))),\"\")","v":"Niveau 1 : ATTENTION ! Réalisation urgente."}]
[null,"G1.1","Objectif",{"$f":"R12","v":"Niveau non concerné"},{"$f":"IF($D12=\"Niveau non concerné\",\"Non concerné\",$Q12)","v":"Non concerné"},{"$f":"IFERROR(IF(E12=Information!$G$23,Information!$H$23,IF(E12<=Information!$F$19,Information!$H$19,IF(E12<=Information!$F$20,Information!$H$20,IF(E12<=Information!$F$21,Information!$H$21,Information!$H$22)))),\"\")","v":"Niveau non concerné"},null,null,null,null,"Nb dir.","Sous-Groupe","Nº du choix","vérifier si Somme = 1 =>  ",null,{"$f":"SUM(P13:P15)","v":1},{"$f":"IFERROR(SUM(Q13:Q15),\"\")","v":0},{"$f":"IFERROR(IF(Q12=Information!$F$23,Information!$H$23,IF(Q12<=Information!$F$19,Information!$G$19,IF(Q12<=Information!$F$20,Information!$G$20,IF(Q12<=Information!$F$21,Information!$G$21,Information!$G$22)))),\"\")","v":"Niveau non concerné"},{"$f":"IF(R12=\"Niveau non concerné\",1,0)","v":1},{"$f":"IF(R12=\"Niveau non concerné\",0,1/COUNTIF($S$12:$S$39,\"=0\"))","v":0},{"$f":"T12*Q12","v":0},null,null,null,null,null,"Non commencé"]
[null,"Dir01","Les objectifs et les engagements du plan d'expérience sont établis ",null,{"$f":"IF($D13=\"Non concerné\",\"Non concerné\",$N13)","v":""},{"$f":"IF(D13=\"\",\"\",CHOOSE($M13,\"Libellé du critère quand il sera choisi\",Information!$A$19,Information!$A$20,Information!$A$21,Information!$A$22,\"Non concerné\"))","v":""},"Vous pouvez commenter",null,null,null,1,{"$f":"$D13","v":0},{"$f":"IFERROR((VLOOKUP($D13,Information!$M$19:$N$23,2,FALSE)),\"\")","v":""},{"$f":"IFERROR(CHOOSE($M13,\"\",Information!$D$19,Information!$D$20,Information!$D$21,Information!$D$22,Information!$D$23),\"\")","v":""},{"$f":"IF(L13=\"Non Concerné\",1,0)","v":0},{"$f":"IF(L13=\"Non Concerné\",0,1/COUNTIF($O$13:$O$15,\"=0\"))","v":0.33333333333333331},{"$f":"IFERROR(N13*P13,\"\")","v":""},null,null,null,null,null,null,null,null,null,"Débuté"]
[null,"Dir02","Les enjeux qui permettent de définir les objectifs du projet sont identifiés",null,{"$f":"IF($D14=\"Non concerné\",\"Non concerné\",$N14)","v":""},{"$f":"IF(D14=\"\",\"\",CHOOSE($M14,\"Libellé du critère quand il sera choisi\",Information!$A$19,Information!$A$20,Information!$A$21,Information!$A$22,\"Non concerné\"))","v":""},"Vous pouvez commenter",null,null,null,2,{"$f":"D14","v":0},{"$f":"IFERROR((VLOOKUP($D14,Information!$M$19:$N$23,2,FALSE)),\"\")","v":""},{"$f":"IFERROR(CHOOSE($M14,\"\",Information!$D$19,Information!$D$20,Information!$D$21,Information!$D$22,Information!$D$23),\"\")","v":""},{"$f":"IF(L14=\"Non Concerné\",1,0)","v":0},{"$f":"IF(L14=\"Non Concerné\",0,1/COUNTIF($O$13:$O$15,\"=0\"))","v":0.33333333333333331},{"$f":"IFERROR(N14*P14,\"\")","v":""},null,null,null,null,null,null,null,null,null,"En cours"]
[null,"Dir03","Les critères de risque et les mesures de l'impact des risques tiennent compte de tous les objectifs du projet",null,"",{"$f":"IF(D15=\"\",\"\",CHOOSE($M15,\"Libellé du critère quand il sera choisi\",Information!$A$19,Information!$A$20,Information!$A$21,Information!$A$22,\"Non concerné\"))","v":""},"Vous pouvez commenter",null,null,null,3,{"$f":"D15","v":0},{"$f":"IFERROR((VLOOKUP($D15,Information!$M$19:$N$23,2,FALSE)),\"\")","v":""},{"$f":"IFERROR(CHOOSE($M15,\"\",Information!$D$19,Information!$D$20,Information!$D$21,Information!$D$22,Information!$D$23),\"\")","v":""},0,{"$f":"IF(L15=\"Non Concerné\",0,1/COUNTIF($O$13:$O$15,\"=0\"))","v":0.33333333333333331},{"$f":"IFERROR(N15*P15,\"\")","v":""},null,null,null,null,null,null,null,null,null,"Réalisé"]
{"$rows_left_out":57}
{"sheet":"Directives","index":6,"n_rows":48,"n_cols":25,"rows_kept":48,"cut":false,"hidden":false,"merged":[[15,1,15,4],[30,1,30,8],[21,1,21,8],[22,1,22,5],[22,6,22,8],[23,6,23,8],[24,6,24,8],[28,1,28,5],[1,1,1,8],[3,1,3,2],[3,3,3,4],[4,1,4,2],[4,3,4,4],[4,7,5,8],[5,1,5,2],[7,1,7,8],[8,1,8,4],[8,5,8,8],[12,1,12,4],[14,1,14,4],[13,1,13,4],[9,5,9,6]]}
[null,{"$f":"Information!A1","v":"Document basé sur la méthode PEPI:2018"},null,null,null,null,null,null,"Impression sur pages A4 100% en format horizontal"]
[null,{"$f":"Information!B3","v":"- PEPI - \nPlan d'Expérience pour la Performance Innovante,\n un outil pour l'industrie"}]
[]
[null,{"$f":"Information!A6","v":"Etablissement :"},null,{"$f":"Information!D6","v":"Nom de l'établissement / entreprise / service..."},null,{"$f":"Prioriser!B4","v":"Date d'application de prioriser : "},{"$f":"IFERROR(IF(Prioriser!D4=\"\",\"\",Prioriser!D4),\"\")","v":"Date"},{"$f":"Prioriser!B7","v":"L'équipe du projet :"},{"$f":"Prioriser!D7","v":"Nom et Prénom des participants"}]
[null,{"$f":"Information!A7","v":" Responsable d'appliquer PEPI : "},null,{"$f":"Information!D7","v":"NOM et Prénom du Responsable Qualité"},null,"Responsable :",{"$f":"IF(Prioriser!D5=\"\",\"\",Prioriser!D5)","v":"NOM et Prénom"},{"$f":"Prioriser!D7","v":"Nom et Prénom des participants"}]
[null,null,null,{"$f":"Information!D8","v":"Email :"},{"$f":"Information!H8","v":"Tél :"},{"$f":"Prioriser!D6","v":"Tél :"},{"$f":"Prioriser!F6","v":"@ :"}]
[]
[null,"TABLEAUX DE BORD de l'évaluation de DIRECTIVES de PEPI",null,null,null,null,null,null,null,null,null,null,null,null,"Utilitaires pour les CALCULS et les GRAPHIQUES"]
[null,{"$f":"CONCATENATE(\"Niveaux d'AVANCEMENT des \", U12,  \" directives évaluées\")","v":"Niveaux d'AVANCEMENT des 0 directives évaluées"},null,null,null,"Résultat global par groupe de directives"]
[null,null,null,null,null,"Moyenne générale :",null,{"$f":"H33","v":0},{"$f":"F33","v":"Niveau non concerné"},null,null,null,"Histogramme des niveaux d'avancement",null,null,null,null,"Histogramme des niveaux de PRIORITÉ"]
[null,null,null,null,null,null,null,null,null,null,null,null,"AVANCEMENT","Nb de directives","Tracer la moyenne",null,"PRIORITÉ",null,"Nb de directives","Ecart vs Total des directives","Total des directives","Total des directives"]
[null,null,null,null,null,null,null,null,null,null,null,null,"Niveaux",{"$f":"SUM(N13:N16)","v":0},": Total ou 0",{"$f":"U12/4","v":0},"Niveaux","N°",{"$f":"SUM(S13:S16)","v":0},{"$f":"46-(S12+S17)","v":46},{"$f":"S18-S17","v":0},{"$f":"S12+S17","v":0}]
[null,{"$f":"CONCATENATE(\"Attention : \",$S$17,\" directives ne sont pas concernées\")","v":"Attention : 0 directives ne sont pas concernées"},null,null,null,null,null,null,null,null,null,null,"Fort",{"$f":"IFERROR(COUNTIFS($G$35:$G$48,M13),0)","v":0},{"$f":"IF($F$33=M13,$P$12,0)","v":0},null,"Non commencé",{"$f":"Information!N19","v":2},{"$f":"IFERROR(COUNTIFS(Prioriser!$M:$M,Directives!$R13),0)","v":0},null,null,{"$f":"S12+S17","v":0}]
[null,{"$f":"IF($S$12<$U$12,CONCATENATE(\"Attention : \",$T$12,\" directives ne sont pas encore traités\"),\"\")","v":""},null,null,null,null,null,null,null,null,null,null,"Haut",{"$f":"IFERROR(COUNTIFS($G$35:$G$48,M14),0)","v":0},{"$f":"IF($F$33=M14,$P$12,0)","v":0},null,"Débuté",{"$f":"Information!N20","v":3},{"$f":"IFERROR(COUNTIFS(Prioriser!$M:$M,Directives!$R14),0)","v":0},null,null,{"$f":"V12-V13","v":0}]
[null,"Niveaux de PRIORITÉ des LIGNES DIRECTRICES de PEPI",null,null,null,null,null,null,null,null,null,null,"Moyen",{"$f":"IFERROR(COUNTIFS($G$35:$G$48,M15),0)","v":0},{"$f":"IF($F$33=M15,$P$12,0)","v":0},null,"En cours",{"$f":"Information!N21","v":4},{"$f":"IFERROR(COUNTIFS(Prioriser!$M:$M,Directives!$R15),0)","v":0}]
{"$rows_left_out":34}
{"sheet":"Prise de décisions","index":7,"n_rows":33,"n_cols":9,"rows_kept":33,"cut":false,"hidden":false,"merged":[[17,6,17,8],[18,6,18,8],[1,1,1,8],[26,6,26,8],[27,6,27,8],[28,6,28,8],[3,1,3,2],[3,3,3,4],[4,7,5,8],[8,6,8,8],[3,7,3,8],[4,1,4,2],[4,3,4,4],[5,1,5,2],[9,6,9,8],[10,6,10,8],[19,6,19,8]]}
[null,{"$f":"Information!A1","v":"Document basé sur la méthode PEPI:2018"},null,null,null,null,null,null,"Impression sur pages A4 100% en format horizontal"]
[null,{"$f":"Information!B3","v":"- PEPI - \nPlan d'Expérience pour la Performance Innovante,\n un outil pour l'industrie"}]
[]
[null,{"$f":"Information!A6","v":"Etablissement :"},null,{"$f":"Information!D6","v":"Nom de l'établissement / entreprise / service..."},null,{"$f":"Prioriser!B4","v":"Date d'application de prioriser : "},{"$f":"IFERROR(IF(Prioriser!D4=\"\",\"\",Prioriser!D4),\"\")","v":"Date"},{"$f":"Prioriser!B7","v":"L'équipe du projet :"}]
[null,{"$f":"Information!A7","v":" Responsable d'appliquer PEPI : "},null,{"$f":"Information!D7","v":"NOM et Prénom du Responsable Qualité"},null,"Responsable : ",{"$f":"Prioriser!D5","v":"NOM et Prénom"},{"$f":"Prioriser!D7","v":"Nom et Prénom des participants"}]
[null,null,null,{"$f":"Information!D8","v":"Email :"},{"$f":"Information!H8","v":"Tél :"},{"$f":"Prioriser!D6","v":"Tél :"},{"$f":"Prioriser!F6","v":"@ :"}]
[]
[null,null,{"$f":"Prioriser!B11","v":"Groupe 1"},{"$f":"Prioriser!C11","v":"Le projet dans son ensemble"}]
[null,null,"Niveau d'évaluation"," Taux de PRIORITÉ aux directives",null,null,"COMMENTAIRES sur les RÉSULTATS obtenus"]
[null,null,{"$f":"Directives!F34","v":"Niveau non concerné"},{"$f":"IF(C10=\"Niveau non concerné\",\"Niveau non concerné\",Directives!H34)","v":"Niveau non concerné"},null,null,"Commentaires :"]
[null,null,null,null,null,null,"DÉCISION : Plan d'action PRIORITAIRE"]
[null,null,null,null,null,null,"QUOI\nObjectifs à atteindre","QUI\nen Interne ou en Externe","QUAND ET OÙ\nDate et Champ d'application"]
[null,null,null,null,null,null,"Action n°1 :"]
[null,null,null,null,null,null,"Action n°2 :"]
[null,null,null,null,null,null,"Action n°3 :"]
{"$rows_left_out":19}
{"sheet":"Innover","index":8,"n_rows":24,"n_cols":7,"rows_kept":24,"cut":false,"hidden":false,"merged":[[23,1,43,6],[9,1,9,6],[6,3,7,5],[1,1,1,6],[2,1,2,2],[2,3,2,6],[3,1,3,2],[3,3,3,5],[3,6,7,6],[4,1,5,2],[4,3,4,5],[5,3,5,4],[6,1,7,2]]}
[]
[null,{"$f":"Information!B3","v":"- PEPI - \nPlan d'Expérience pour la Performance Innovante,\n un outil pour l'industrie"}]
[null,{"$f":"Information!$A$6","v":"Etablissement :"},null,{"$f":"Information!D6","v":"Nom de l'établissement / entreprise / service..."}]
[null,"Date d'application d'innover :",null,"Date",null,null,"Signature du responsable du projet :\n\n\n\n\n"]
[null,"Responsable du projet :",null,{"$f":"Problématiser!D5","v":"NOM et Prénom"}]
[null,null,null,{"$f":"Problématiser!D6","v":"Tél :"},null,{"$f":"Problématiser!F6","v":"@ :"}]
[null,"L'équipe du projet :",null,{"$f":"Problématiser!D7","v":"Nom et Prénom des participants"}]
[]
[]
[null,"INNOVER"]
[]
[]
[]
[]
[]
{"$rows_left_out":9}