{"text_format":"1","workbook":"xlsx","n_sheets":5,"sheets":["Guide d'utilisation","Exigences","Résultats globaux","Résultats par Article","Conseils"],"not_rendered":{"charts":11,"images":3,"macros":1,"external_links":0,"defined_names":11,"comments":1,"pivot_tables":0},"unopened":[],"bounds":{"document_bytes":16777216,"sheet_cells":100000,"rows_first":2000,"rows_last":500,"rows_between":2000,"halvings":0,"cell_chars":16384,"cell_head_chars":4096},"cells_cut":0,"cells_raw":0,"read":"whole","date_system":"1900"}

{"sheet":"Guide d'utilisation","index":0,"n_rows":22,"n_cols":14,"rows_kept":22,"cut":false,"hidden":false,"merged":[[13,1,13,9],[4,1,4,3],[4,4,4,9],[15,1,15,2],[3,1,3,9],[8,1,8,9],[9,1,12,9],[14,5,14,9],[5,4,5,9],[6,8,6,9],[14,1,14,4],[21,1,21,9],[16,1,16,2],[15,8,15,9],[16,8,16,9],[20,1,20,9],[19,1,19,2],[18,1,18,2],[17,1,17,2],[17,8,17,9],[18,8,18,9],[19,8,19,9],[1,3,1,9],[5,1,5,3],[6,1,6,3],[6,4,6,7],[2,3,2,9]]}
[null,"Document d'appui à la déclaration première partie de conformité à la norme ISO 30301:2011",null,null,null,null,null,null,null,"Enregistrement qualité :  A4 100% vertical"]
[null,null,null,"   Autodiagnostic selon la norme ISO 30301:2011"]
[null,null,null,"    \"Systèmes de gestion des documents d'activité - Exigences\"\nédition  Afnor, www.afnor.org, Décembre 2011"]
[null,"        Attention : Seules les cases blanches écrites en bleu peuvent être modifiées par l’utilisateur. Cela concerne toutes les parties de l’outil"]
[null,"Etablissement :",null,null,"Nom de l'établissement / entreprise / organisation..."]
[null," Responsable du SMQ : ",null,null,"NOM et Prénom du Responsable Qualité"]
[null," Contact du Responsable du SMQ :",null,null,"email :",null,null,null,"Tél :"]
[]
[null,"Mode d'emploi"]
[null,"\nOBJECTIF:   \nCet outil permet aux différents utilisateurs, et en particulier aux responsables qualité d'un organisme, d'évaluer la conformité du système de gestion des documents d'activité (SGDA) selon les exigences de la norme ISO 30301:2011. Il sert aussi de tableau de bord avec lequel vous pouvez commenter, suivre et évaluer la progression de la mise en oeuvre et du maitien de votre SGDA. Ainsi, il vous donnera plus de visibilité afin de prendre les décisions et d'élaborer des actions d'amélioration continue. \n(NB : Cet outil ne garantit pas une certification)\n\nPRESENTATION DES ELEMENTS:  \nLa grille est constituée de six (6) onglets :\n- Guide d'utilisation :\n         * Explicite le fonctionnement de l'outil et les critères d'évaluation définis\n- Exigences : \n         * Des critères d'évaluation par article et sous article sont définis\n         * Des commentaires explicitent les critères aux utilisateurs\n- Résultats et Actions :\n         * Tous les résultats sont réunis sur cet onglet \n- Résultats par article : \n         * Taux de CONFORMITÉ sous forme radar\n         * Les plans d'action prioritaires à mettre en œuvre et à déployer (Quoi, Qui, Quand...)                                                                                                           -Conseils : \n         * Expliquent globalement l'objet de chaque article de la norme  \n\n"]
[]
[null,null,null,null,null,null,null,null,null,null,null,null,"Utilitaires pour l'Autodiagnostic"]
[null,null,null,null,null,null,null,null,null,null,null,null,"Paramétrage des affectations selon le N° du choix"]
[null,null,null,null,null,null,null,null,null,null,null,null,"Utilisé pour  {Exigences} : affectation d'un N° selon le choix réalisé"]
[null,"Niveaux de VÉRACITÉ quant à la RÉALISATION \ndes actions associées aux exigences de la norme",null,null,null,"LIBELLÉS des niveaux de CONFORMITÉ \ndes ARTICLES de la norme ",null,null,null,null,null,null,"Choix proposé","A faire en manuel\nN° du choix croissant selon son  Ordre Alphabétique : 1 à …"]
{"$rows_left_out":8}
{"sheet":"Exigences","index":1,"n_rows":136,"n_cols":23,"rows_kept":136,"cut":false,"hidden":false,"merged":[[72,4,72,5],[76,4,76,5],[65,4,65,5],[54,4,54,5],[24,4,24,5],[25,4,25,5],[40,4,40,5],[41,4,41,5],[46,4,46,5],[30,4,30,5],[35,4,35,5],[13,29,13,31],[15,29,15,31],[12,29,12,31],[131,4,131,5],[84,4,84,5],[85,4,85,5],[92,4,92,5],[115,4,115,5],[102,4,102,5],[103,4,103,5],[109,4,109,5],[98,4,98,5],[120,4,120,5],[121,4,121,5],[55,4,55,5],[60,4,60,5],[1,1,1,5],[21,4,21,5],[3,0,3,1],[2,0,2,1],[2,2,2,5],[3,2,3,4],[5,2,5,3],[4,0,5,1],[6,0,7,1],[6,2,7,4],[3,5,7,5],[11,4,11,5],[16,4,16,5],[4,2,4,4],[10,4,10,5]]}
[{"$f":"'Guide d''utilisation'!B1","v":"Document d'appui à la déclaration première partie de conformité à la norme ISO 30301:2011"},null,null,null,null,"Impression sur pages A4 100% en format horizontal"]
[null,"  Autodiagnostic sur les exigences de l'ISO 30301:2011",null,null,null,null,null,null,null,null,null,null,null,null,null,null,"Somme des pondérations des Articles","Taux moyen de conformité sur la Norme","Niveau de RESPECT pour la norme"]
[{"$f":"'Guide d''utilisation'!B5","v":"Etablissement :"},null,{"$f":"'Guide d''utilisation'!E5","v":"Nom de l'établissement / entreprise / organisation..."},null,null,null,null,null,null,null,"Somme des pondérations sur les exigences","Taux  moyen de CONFORMITÉ pour le sous-article","Niveau de RESPECT pour le sous-article","Automatique : pondération de chaque sous- chapitre","Taux  moyen de CONFORMITÉ pondéré pour le sous-article"]
["Date de l'autodiagnostic : ",null,null,null,null,"Signature du responsable de l'autodiagnostic :\n\n\n\n\n"]
["Responsable de l'autodiagnostic : ",null,"NOM et Prénom",null,null,null,null,"Choix réalisé","N° du choix réalisé","% Véracité du choix","Automatique : pondération de chaque exigence","Taux de CONFORMITÉ pondéré sur l'exigence",null,null,null,"Resultats, Actions et REX "]
[null,null,"Tél :",null,"Email :"]
["L'équipe d'autodiagnostic :",null,"Noms et Prénoms des participants"]
[]
[]
["Réf.","Critères d'exigence des articles de la norme","Evaluations","Taux %","Libellés \ndes évaluations","Modes de preuve \net commentaires",null,null,null,null,null,null,null,null,null,null,null,null,null,null,null,"Choix proposé","A faire en manuel\nN° du choix croissant selon son  Ordre Alphabétique : 1 à …"]
["Art. 4","Contexte de l'organisme",{"$f":"P11","v":"Insuffisant"},{"$f":"O11","v":0},{"$f":"IFERROR(IF(D11<='Guide d''utilisation'!$G$17,'Guide d''utilisation'!$I$17,IF(D11<='Guide d''utilisation'!$G$18,'Guide d''utilisation'!$I$18,IF(D11<='Guide d''utilisation'!$G$19,'Guide d''utilisation'!$I$19,'Guide d''utilisation'!$I$20))),\"\")","v":"Conformité de niveau 1 : Il est nécessaire de formaliser les activités réalisées."},null,null,"Article",null,null,null,null,"vérifier si Somme = 1 =>  ",{"$f":"SUM(N12:N24)","v":1},{"$f":"IFERROR(SUM(O12:O24),\"\")","v":0},{"$f":"IFERROR(IF(O11<='Guide d''utilisation'!$G$17,'Guide d''utilisation'!$H$17,IF(O11<='Guide d''utilisation'!$G$18,'Guide d''utilisation'!$H$18,IF(O11<='Guide d''utilisation'!$G$19,'Guide d''utilisation'!$H$19,'Guide d''utilisation'!$H$20))),\"\")","v":"Insuffisant"},{"$f":"1/7","v":0.14285714285714285},{"$f":"O11*Q11","v":0},null,null,null,"Choix de \nVÉRACITÉ",1]
["4.1","Compréhension de l'organisme et de son contexte",{"$f":"M12","v":"Insuffisant"},{"$f":"L12","v":0},{"$f":"IFERROR(IF(D12<='Guide d''utilisation'!$G$17,'Guide d''utilisation'!$I$17,IF(D12<='Guide d''utilisation'!$G$18,'Guide d''utilisation'!$I$18,IF(D12<='Guide d''utilisation'!$G$19,'Guide d''utilisation'!$I$19,'Guide d''utilisation'!$I$20))),\"\")","v":"Conformité de niveau 1 : Il est nécessaire de formaliser les activités réalisées."},null,"Nb critères","Sous-Article",null,"vérifier si Somme = 1 =>  ",{"$f":"SUM(K13:K16)","v":1},{"$f":"IFERROR(SUM(L13:L16),\"\")","v":0},{"$f":"IFERROR(IF(L12<='Guide d''utilisation'!$G$17,'Guide d''utilisation'!$H$17,IF(L12<='Guide d''utilisation'!$G$18,'Guide d''utilisation'!$H$18,IF(L12<='Guide d''utilisation'!$G$19,'Guide d''utilisation'!$H$19,'Guide d''utilisation'!$H$20))),\"\")","v":"Insuffisant"},{"$f":"1/COUNTA($M$12:$M$24)","v":0.33333333333333331},{"$f":"N12*L12","v":0},null,null,null,null,null,null,"Faux",2]
["cr 1","Les enjeux externes et internes sont identifiés et documentés lors de l'établissement et de la revue du Système de Gestion des Documents d'Activités (SGDA)","Choix de \nVÉRACITÉ",{"$f":"J13","v":""},{"$f":"CHOOSE(I13,\"Libellé du critère quand il sera choisi\",'Guide d''utilisation'!$B$17,'Guide d''utilisation'!$B$18,'Guide d''utilisation'!$B$19,'Guide d''utilisation'!$B$20,,)","v":"Libellé du critère quand il sera choisi"},null,1,{"$f":"C13","v":"Choix de \rVÉRACITÉ"},{"$f":"IFERROR((VLOOKUP(C13,'Guide d''utilisation'!$M$16:$N$20,2)),\"\")","v":1},{"$f":"IFERROR(CHOOSE(I13,\"\",'Guide d''utilisation'!$E$17,'Guide d''utilisation'!$E$18,'Guide d''utilisation'!$E$19,'Guide d''utilisation'!$E$20,),\"\")","v":""},{"$f":"1/COUNTA($B$13:$B$16)","v":0.25},{"$f":"IFERROR(J13*K13,\"\")","v":""},null,null,null,null,null,null,null,null,null,"Plutôt Faux",3]
[{"$f":"CONCATENATE(\"cr \",MID(A13,3,4)+1)","v":"cr 2"},"Les facteurs d'influence sur les objectifs de l'organisme sont pris en compte","Choix de \nVÉRACITÉ",{"$f":"J14","v":""},{"$f":"CHOOSE(I14,\"Libellé du critère quand il sera choisi\",'Guide d''utilisation'!$B$17,'Guide d''utilisation'!$B$18,'Guide d''utilisation'!$B$19,'Guide d''utilisation'!$B$20,,)","v":"Libellé du critère quand il sera choisi"},null,{"$f":"G13+1","v":2},{"$f":"C14","v":"Choix de \rVÉRACITÉ"},{"$f":"IFERROR((VLOOKUP(C14,'Guide d''utilisation'!$M$16:$N$20,2)),\"\")","v":1},{"$f":"IFERROR(CHOOSE(I14,\"\",'Guide d''utilisation'!$E$17,'Guide d''utilisation'!$E$18,'Guide d''utilisation'!$E$19,'Guide d''utilisation'!$E$20,),\"\")","v":""},{"$f":"1/COUNTA($B$13:$B$16)","v":0.25},{"$f":"IFERROR(J14*K14,\"\")","v":""},null,null,null,null,null,null,null,null,null,"Plutôt Vrai",4]
[{"$f":"CONCATENATE(\"cr \",MID(A14,3,4)+1)","v":"cr 3"},"Les parties prenantes ainsi que leurs attentes sont identifiés ","Choix de \nVÉRACITÉ",{"$f":"J15","v":""},{"$f":"CHOOSE(I15,\"Libellé du critère quand il sera choisi\",'Guide d''utilisation'!$B$17,'Guide d''utilisation'!$B$18,'Guide d''utilisation'!$B$19,'Guide d''utilisation'!$B$20,,)","v":"Libellé du critère quand il sera choisi"},null,{"$f":"G14+1","v":3},{"$f":"C15","v":"Choix de \rVÉRACITÉ"},{"$f":"IFERROR((VLOOKUP(C15,'Guide d''utilisation'!$M$16:$N$20,2)),\"\")","v":1},{"$f":"IFERROR(CHOOSE(I15,\"\",'Guide d''utilisation'!$E$17,'Guide d''utilisation'!$E$18,'Guide d''utilisation'!$E$19,'Guide d''utilisation'!$E$20,),\"\")","v":""},{"$f":"1/COUNTA($B$13:$B$16)","v":0.25},{"$f":"IFERROR(J15*K15,\"\")","v":""},null,null,null,null,null,null,null,null,null,"Vrai",5]
{"$rows_left_out":122}
{"sheet":"Résultats globaux","index":2,"n_rows":61,"n_cols":19,"rows_kept":61,"cut":false,"hidden":false,"merged":[[24,5,24,7],[30,0,30,7],[28,0,28,4],[3,0,3,3],[5,0,5,1],[6,0,6,1],[5,2,5,3],[23,5,23,7],[15,0,15,3],[5,6,6,7],[13,0,13,3],[9,4,9,7],[4,0,4,1],[4,2,4,3],[14,0,14,3],[22,0,22,4],[22,5,22,7],[8,0,8,7],[21,0,21,7],[9,0,9,3],[12,10,12,18]]}
[{"$f":"'Guide d''utilisation'!B1","v":"Document d'appui à la déclaration première partie de conformité à la norme ISO 30301:2011"},null,null,null,null,null,null,"Impression sur pages A4 100% en format horizontal"]
[null,null,null,null,{"$f":"'Guide d''utilisation'!D2","v":"   Autodiagnostic selon la norme ISO 30301:2011"}]
[]
["Informations sur le Service Management de la Qualité",null,null,null,null,null,"Informations sur l'Autodiagnostic"]
[{"$f":"'Guide d''utilisation'!B5","v":"Etablissement :"},null,{"$f":"'Guide d''utilisation'!E5","v":"Nom de l'établissement / entreprise / organisation..."},null,{"$f":"Exigences!A4","v":"Date de l'autodiagnostic : "},{"$f":"IF(Exigences!C4=\"\",\"\",Exigences!C4)","v":""},{"$f":"Exigences!A7","v":"L'équipe d'autodiagnostic :"}]
[{"$f":"'Guide d''utilisation'!B6","v":" Responsable du SMQ : "},null,{"$f":"'Guide d''utilisation'!E6","v":"NOM et Prénom du Responsable Qualité"},null,"Responsable : ",{"$f":"IF(Exigences!C5=\"\",\"\",Exigences!C5)","v":"NOM et Prénom"},{"$f":"Exigences!C7","v":"Noms et Prénoms des participants"}]
[null,null,{"$f":"'Guide d''utilisation'!E7","v":"email :"},{"$f":"'Guide d''utilisation'!I7","v":"Tél :"},{"$f":"IF(Exigences!C6=\"\",\"\",Exigences!C6)","v":"Tél :"},{"$f":"IF(Exigences!E6=\"\",\"\",Exigences!E6)","v":"Email :"}]
[]
["TABLEAUX DE BORD sur les niveaux de CONFORMITÉ et de RÉALISATION selon les exigences de la norme ISO 30301:2011",null,null,null,null,null,null,null,null,null,null,null,"Utilitaires pour les CALCULS et les GRAPHIQUES"]
[{"$f":"CONCATENATE(\"Niveaux de VÉRACITÉ des \", S13, \" critères d'exigence \")","v":"Niveaux de VÉRACITÉ des 98 critères d'exigence "},null,null,null,"Niveaux de CONFORMITÉ des ARTICLES aux exigences de la norme"]
[null,null,null,null,null,"Moyenne générale :",{"$f":"G33","v":0},{"$f":"E33","v":"Insuffisant"},null,null,"Histogramme des niveaux de CONFORMITÉ",null,null,null,null,"Histogramme des niveaux de VÉRACITÉ"]
[null,null,null,null,null,null,null,null,null,null,"CONFORMITÉ","Nb d'Articles","Tracer la moyenne",null,"VÉRACITÉ",null,"Nb de critères d'exigences","Ecart vs Total des critères","Total des critères"]
[null,null,null,null,null,null,null,null,null,null,"Niveaux",{"$f":"SUM(L14:L17)","v":21},": Total ou 0",null,"Niveaux","N°",{"$f":"SUM(Q14:Q17)","v":0},{"$f":"154-Q13","v":154},{"$f":"MAX(Exigences!G1:G137)","v":98}]
[{"$f":"IF(Q13<S13,CONCATENATE(\"Attention : \",R13,\" critères ne sont pas encore traités\"),\"\")","v":"Attention : 154 critères ne sont pas encore traités"},null,null,null,null,null,null,null,null,null,{"$f":"'Guide d''utilisation'!H17","v":"Insuffisant"},{"$f":"IFERROR(COUNTIFS($F$35:$F$61,K14),0)","v":21},{"$f":"IF($E$33=K14,30,0)","v":30},null,"Faux",{"$f":"'Guide d''utilisation'!N17","v":2},{"$f":"IFERROR(COUNTIFS(Exigences!$I$13:$I$136,$P14),0)","v":0}]
["Niveaux de CONFORMITÉ des 21 SOUS-ARTICLES de la norme (et Moyenne)",null,null,null,null,null,null,null,null,null,{"$f":"'Guide d''utilisation'!H18","v":"Informel"},{"$f":"IFERROR(COUNTIFS($F$35:$F$61,K15),0)","v":0},{"$f":"IF($E$33=K15,30,0)","v":0},null,"Plutôt Faux",{"$f":"'Guide d''utilisation'!N18","v":3},{"$f":"IFERROR(COUNTIFS(Exigences!$I$13:$I$136,$P15),0)","v":0}]
{"$rows_left_out":47}
{"sheet":"Résultats par Article","index":3,"n_rows":70,"n_cols":8,"rows_kept":70,"cut":false,"hidden":false,"merged":[[3,0,3,3],[4,0,4,1],[4,2,4,3],[5,6,6,7],[9,5,9,7],[37,5,37,7],[38,5,38,7],[10,5,10,7],[11,5,11,7],[5,0,5,1],[5,2,5,3],[6,0,6,1],[18,5,18,7],[19,5,19,7],[20,5,20,7],[27,5,27,7],[28,5,28,7],[29,5,29,7],[36,5,36,7],[65,5,65,7],[54,5,54,7],[55,5,55,7],[56,5,56,7],[45,5,45,7],[46,5,46,7],[47,5,47,7],[63,5,63,7],[64,5,64,7]]}
[{"$f":"'Guide d''utilisation'!B1","v":"Document d'appui à la déclaration première partie de conformité à la norme ISO 30301:2011"},null,null,null,null,null,null,"Impression sur pages A4 100% en format horizontal"]
[null,null,null,null,"  Résultats détaillés par ARTICLE de l'autodiagnostic selon la norme ISO 30301:2011"]
[]
["Informations sur le Service Management de la Qualité",null,null,null,null,null,"Informations sur l'Autodiagnostic"]
[{"$f":"'Guide d''utilisation'!B5","v":"Etablissement :"},null,{"$f":"'Guide d''utilisation'!E5","v":"Nom de l'établissement / entreprise / organisation..."},null,{"$f":"Exigences!A4","v":"Date de l'autodiagnostic : "},{"$f":"IF(Exigences!C4=\"\",\"\",Exigences!C4)","v":""},{"$f":"Exigences!A7","v":"L'équipe d'autodiagnostic :"}]
[{"$f":"'Guide d''utilisation'!B6","v":" Responsable du SMQ : "},null,{"$f":"'Guide d''utilisation'!E6","v":"NOM et Prénom du Responsable Qualité"},null,"Responsable : ",{"$f":"IF(Exigences!C5=\"\",\"\",Exigences!C5)","v":"NOM et Prénom"},{"$f":"Exigences!C7","v":"Noms et Prénoms des participants"}]
[null,null,{"$f":"'Guide d''utilisation'!E7","v":"email :"},{"$f":"'Guide d''utilisation'!I7","v":"Tél :"},{"$f":"IF(Exigences!C6=\"\",\"\",Exigences!C6)","v":"Tél :"},{"$f":"IF(Exigences!E6=\"\",\"\",Exigences!E6)","v":"Email :"}]
[]
[null,{"$f":"Exigences!A11","v":"Art. 4"},{"$f":"Exigences!B11","v":"Contexte de l'organisme"}]
[null,"Niveau d'évaluation"," Taux de CONFORMITÉ aux critères d'exigence",null,null,"COMMENTAIRES sur les RÉSULTATS obtenus"]
[null,{"$f":"'Résultats globaux'!E34","v":"Insuffisant"},{"$f":"'Résultats globaux'!G34","v":0},null,null,"Commentaires (collectifs si possible)  :"]
[null,null,null,null,null,"DÉCISIONS : Plans d'action PRIORITAIRES"]
[null,null,null,null,null,"QUOI\nObjectifs à atteindre","QUI\nen Interne ou en Externe","QUAND ET OÙ\nDate et Champ d'application"]
[null,null,null,null,null,"Plan n°1 :"]
[null,null,null,null,null,"Plan n°2 :"]
{"$rows_left_out":56}
{"sheet":"Conseils","index":4,"n_rows":33,"n_cols":7,"rows_kept":33,"cut":false,"hidden":false,"merged":[[3,0,3,2],[31,4,32,4],[6,4,8,4],[10,4,12,4],[14,4,15,4],[17,4,21,4],[23,4,25,4],[6,3,8,3],[10,3,12,3],[14,3,15,3],[17,3,21,3],[23,3,25,3],[27,3,29,3],[31,3,32,3],[9,0,9,4],[30,0,30,4],[8,6,9,6],[10,6,13,6],[14,6,15,6],[27,4,29,4],[5,0,5,4],[13,0,13,4],[16,0,16,4],[22,0,22,4],[26,0,26,4]]}
[null,null,null,"   Autodiagnostic selon la norme ISO 30301:2011"]
[null,null,null,"\"Système de gestion des documents d'activité - Exigences\", édition  Afnor, www.afnor.org, Décembre 2011"]
[]
[null,null,null,"Quelques CONSEILS pour atteindre le respect des exigences..."]
[null,null,"Articles","Quoi","Qui"]
["Art. 4    Contexte de l'organisme"]
[null,"4.1","Compréhension de l'organisme et de son contexte","L’organisme doit déterminer les enjeux internes et externes liés au contexte socio-économique dans lequel il se situe. De plus, les parties intéressées doivent être identifiées ainsi que leurs attentes et exigences. Ces dernières seront listées et revus périodiquement. L'organisme doit tenir compte, évaluer et documenter ses besoins opérationnels, les exigences légales et autres exigences . Le domaine d'application du système de gestion des documents d'activité  (SGDA) est fixé, ainsi que l'ensemble des processus nécessaires à la mise en oeuvre de ce système.","Responsable Qualité et Direction Générale"]
[null,"4.2","Exigences opérationnelles, exigences légales et autres exigences"]
[null,"4.3","Détermination du domaine d'application du SGDA",null,null,null,"Lien : UTC  - www.utc.fr/master-qualite, puis \"Travaux\" \"Qualité-Management\", réf n°451"]
["Art. 5    Leadership"]
[null,"5.1","Engagement de la direction","Dans cet article, la responsabilité de la direction est de communiquer sa politique qualité qu'elle l'appliquera et la mettra à jour par la suite. L'engagement de la direction consiste aussi à attribuer les responsabilités et les autorités au sein de l'organisme afin d'appliquer sa politique qualité.","Responsable Qualité et Direction Générale",null,"http://www.utc.fr/master-qualite/public/publications/qualite_et_management/MQ_M2/2017-2018/MIM_stages/TEBOURBI_Imen/index.html"]
[null,"5.2","Politique "]
[null,"5.3","Rôles, responsabilités et habilitations au sein de l'organisme"]
["Art. 6    Planification "]
[null,"6.1","Actions à mener pour prendre en compte les risques et opportunités","Ce paragraphe stipule l’identification des risques liés aux enjeux de l’organisme et de prendre les mesures nécessaires pour y remédier.\nDes objectifs fixés, pertinents et cohérents avec la politique sont à atteindre ,concernant les documents d'activité, doivent être documentés, communiqués à l’ensemble des acteurs afin de pouvoir évaluer la performance.","Responsable Qualité et Direction Générale"]
{"$rows_left_out":18}